Bugs in Archlinux32 packages, specific to 32-bit issues.

Bugs  FS#2  to  FS#92  have been recovered and may be incomplete, the
recovered Google/Bing cache data can be found here.

IDCategoryTask TypePriority  descSeveritySummaryStatusProgress
257PackagesBug ReportMediumLow[openjdk 11/17/18] fails to build almost in all version...New
0%
Task Description

no task description

265PackagesBug ReportMediumLow[python] starts to depend on Rust (i486)New
0%
Task Description

Traceback (most recent call last):

File "/build/python-cryptography/src/cryptography-37.0.2/setup.py", line 14, in <module>
  from setuptools_rust import RustExtension

ModuleNotFoundError: No module named ‘setuptools_rust’

# no rust for now on i486
if [ “$CARCH” = ‘i486’ ]; then

makedepends=(${makedepends[@]//python-setuptools-rust/})

fi

This affects i486, so we are forced to bootstrap Rust on i486..

275PackagesBug ReportMediumLow[protobuf] breaks heavily on 32-bitNew
0%
Task Description

/build/protobuf/src/protobuf-21.2/src/google/protobuf/repeated_field.h: In instantiation of ‘constexpr int google::protobuf::internal::RepeatedFieldLowerClampLimit() [with T = long long int; int kRepHeaderSize = 4]’:

/data/work/arch32/protobuf/src/protobuf-21.2/src/google/protobuf/repeated_field.h:81:27: note: the comparison reduces to ‘(8 ⇐ 4)’

276PackagesBug ReportMediumLowLTO optimization needs to much memoryNew
0%
Task Description

7234 build 20 0 1353768 1.2g 18020 R 96.1 64.0 4:27.92 lto1-wpa

xf86-video-intel (this is not exactly a huge package, but maybe the
included X libraries are?)

We lost it on i486 already (because it doesn’t work with newer gcc, or at least
I didn’t investigate how to make it work).

I suggest to get rid of LTO completely.
The problem is patching all the options=(lto), –enable-lto/ –without-lto -D b_lto=tru
etc. which easily creates a maintainance nightmare.

Maybe an easier way to go is to have them similar to the ‘lib32-’ stripping
in the main build scripts or hooks? Downstream this might create
trouble tough, as the build systems are different..

Upstream has options=(lto) support, but it doesn’t seen helping here as packages
need local flags everywhere..

280PackagesBug ReportMediumLow[mesa] and [mesa-amber] fail on DRI-2 on i486New
0%
Task Description

Most likely DRI-2 has been removed, rendering a whole bunch of old cards useless.

282PackagesBug ReportMediumLow[qt5-webengine] fails with LTO and one definition ruleNew
0%
Task Description

After hours of compiling:

release/../../../../qtwebengine/src/3rdparty/chromium/base/memory/ref_counted.h:145:19: warning: type ‘struct RefCountedThreadSafeBase’ violates the C++ One Definition Ru
le [-Wodr]
  145 | class BASE_EXPORT RefCountedThreadSafeBase {
      |                   ^
/usr/src/debug/qtwebengine/src/3rdparty/chromium/base/memory/ref_counted.h:145:19: note: a different type is defined in another translation unit
/usr/src/debug/qtwebengine/src/3rdparty/chromium/base/memory/ref_counted.h:229:16: note: the first difference of corresponding 
definitions is field ‘needs_adopt_ref_’
/usr/src/debug/qtwebengine/src/3rdparty/chromium/base/memory/ref_counted.h:145:19: note: a type with different number of fields is defined in another translation unit
release/../../../../qtwebengine/src/3rdparty/chromium/base/memory/ref_counted.h:387:7: warning: type ‘struct RefCountedThreadSafe’ violates the C++ One Definition Rule [-
Wodr]
  387 | class RefCountedThreadSafe : public subtle::RefCountedThreadSafeBase {
      |       ^
/usr/src/debug/qtwebengine/src/3rdparty/chromium/base/memory/ref_counted.h:387:7: note: a type with different bases is defined in another translation unit
release/../../../../qtwebengine/src/3rdparty/chromium/base/memory/ref_counted.h:387:7: warning: type ‘struct RefCountedThreadSafe’ violates the C++ One Definition Rule [-Wodr]
  387 | class RefCountedThreadSafe : public subtle::RefCountedThreadSafeBase {
      |       ^
/usr/src/debug/qtwebengine/src/3rdparty/chromium/base/memory/ref_counted.h:387:7: note: a type with different bases is defined in another translation unit
/usr/src/debug/qtwebengine/src/core/net/cookie_monster_delegate_qt.h:87:38: warning: type ‘struct CookieMonsterDelegateQt’ violates the C++ One Definition Rule [-Wodr]
/usr/src/debug/qtwebengine/src/core/net/cookie_monster_delegate_qt.h:87:38: note: a type with different bases is defined in another translation unit
/usr/src/debug/qtwebengine/src/core/net/cookie_monster_delegate_qt.h:104:10: warning: type of ‘setCookie’ does not match original declaration [-Wlto-type-mismatch]
/usr/src/debug/qtwebengine/src/core/net/cookie_monster_delegate_qt.cpp:134:6: note: ‘setCookie’ was previously declared here
/usr/src/debug/qtwebengine/src/core/net/cookie_monster_delegate_qt.cpp:134:6: note: code may be misoptimized unless ‘-fno-strict-aliasing’ is used
/usr/src/debug/qtwebengine/src/core/net/cookie_monster_delegate_qt.h:113:10: warning: type of ‘setHasFilter’ does not match original declaration [-Wlto-type-mismatch]
/usr/src/debug/qtwebengine/src/core/net/cookie_monster_delegate_qt.cpp:212:6: note: ‘setHasFilter’ was previously declared here
/usr/src/debug/qtwebengine/src/core/net/cookie_monster_delegate_qt.cpp:212:6: note: code may be misoptimized unless ‘-fno-strict-aliasing’ is used
/usr/src/debug/qtwebengine/src/core/net/cookie_monster_delegate_qt.h:108:10: warning: type of ‘deleteAllCookies’ does not match original declaration [-Wlto-type-mismatch]
/usr/src/debug/qtwebengine/src/core/net/cookie_monster_delegate_qt.cpp:183:6: note: ‘deleteAllCookies’ was previously declared here
/usr/src/debug/qtwebengine/src/core/net/cookie_monster_delegate_qt.cpp:183:6: note: code may be misoptimized unless ‘-fno-strict-aliasing’ is used
/usr/src/debug/qtwebengine/src/core/net/cookie_monster_delegate_qt.h:107:10: warning: type of ‘deleteSessionCookies’ does not match original declaration [-Wlto-type-mismatch]
/usr/src/debug/qtwebengine/src/core/net/cookie_monster_delegate_qt.cpp:171:6: note: ‘deleteSessionCookies’ was previously declared here
/usr/src/debug/qtwebengine/src/core/net/cookie_monster_delegate_qt.cpp:171:6: note: code may be misoptimized unless ‘-fno-strict-aliasing’ is used
/usr/src/debug/qtwebengine/src/core/net/cookie_monster_delegate_qt.h:105:10: warning: type of ‘deleteCookie’ does not match original declaration [-Wlto-type-mismatch]
/usr/src/debug/qtwebengine/src/core/net/cookie_monster_delegate_qt.cpp:158:6: note: ‘deleteCookie’ was previously declared here
/usr/src/debug/qtwebengine/src/core/net/cookie_monster_delegate_qt.cpp:158:6: note: code may be misoptimized unless ‘-fno-strict-aliasing’ is used
/usr/src/debug/qtwebengine/src/core/net/cookie_monster_delegate_qt.h:106:10: warning: type of ‘getAllCookies’ does not match original declaration [-Wlto-type-mismatch]
/usr/src/debug/qtwebengine/src/core/net/cookie_monster_delegate_qt.cpp:129:6: note: ‘getAllCookies’ was previously declared here
/usr/src/debug/qtwebengine/src/core/net/cookie_monster_delegate_qt.cpp:129:6: note: code may be misoptimized unless ‘-fno-strict-aliasing’ is used
/usr/src/debug/qtwebengine/src/core/net/cookie_monster_delegate_qt.h:102:10: warning: type of ‘hasCookieMonster’ does not match original declaration [-Wlto-type-mismatch]
/usr/src/debug/qtwebengine/src/core/net/cookie_monster_delegate_qt.cpp:124:6: note: ‘hasCookieMonster’ was previously declared here
/usr/src/debug/qtwebengine/src/core/net/cookie_monster_delegate_qt.cpp:124:6: note: code may be misoptimized unless ‘-fno-strict-aliasing’ is used
/usr/src/debug/qtwebengine/src/core/api/qwebenginecallback_p.h:136:12: warning: virtual table of type ‘struct CallbackSharedDataPointer’ violates one definition rule [-Wodr]
/usr/src/debug/qtwebengine/src/core/api/qwebenginecallback_p.h:136:12: note: the conflicting type defined in another translation unit has virtual table with more entries
/usr/src/debug/qtwebengine/src/core/api/qwebenginecallback_p.h:136:12: warning: virtual table of type ‘struct CallbackSharedDataPointer’ violates one definition rule [-Wodr]
/usr/src/debug/qtwebengine/src/core/api/qwebenginecallback_p.h:136:12: note: the conflicting type defined in another translation unit has virtual table with more entries
/usr/src/debug/qtwebengine/src/core/api/qwebenginecallback_p.h:136:12: warning: virtual table of type ‘struct CallbackSharedDataPointer’ violates one definition rule [-Wodr]
/usr/src/debug/qtwebengine/src/core/api/qwebenginecallback_p.h:136:12: note: the conflicting type defined in another translation unit has virtual table with more entries
/usr/src/debug/qtwebengine/src/core/api/qwebenginecallback_p.h:136:12: warning: virtual table of type ‘struct CallbackSharedDataPointer’ violates one definition rule [-Wodr]
/usr/src/debug/qtwebengine/src/core/api/qwebenginecallback_p.h:136:12: note: the conflicting type defined in another translation unit has virtual table with more entries
/usr/src/debug/qtwebengine/src/core/api/qwebenginecallback_p.h:136:12: warning: virtual table of type ‘struct CallbackSharedDataPointer’ violates one definition rule [-Wodr]
/usr/src/debug/qtwebengine/src/core/api/qwebenginecallback_p.h:136:12: note: the conflicting type defined in another translation unit has virtual table with more entries
during RTL pass: pro_and_epilogue
release/gen/services/network/public/mojom/content_security_policy.mojom.h: In member function ‘Clone’:
release/gen/services/network/public/mojom/content_security_policy.mojom.h:1666:1: internal compiler error: in find_oldest_value_reg, at regcprop.cc:460

This is sort of unmaintainable..

284PackagesBug ReportMediumLow[qt] breaks on i686 and i486 (uses SSE2 optimisations)New
0%
Task Description

no task description

290PackagesBug ReportMediumLow[qt6-webengine] fails building with nodeNew
0%
Task Description
Traceback (most recent call last):
  File "/build/qt6-webengine/src/build/src/core/RelWithDebInfo/i686/../../../../../qtwebengine-everywhere-src-6.3.2/src/3rdparty/chromium/third_party/node/node.py", line 62, in <module>
    RunNode(sys.argv[1:])
  File "/build/qt6-webengine/src/build/src/core/RelWithDebInfo/i686/../../../../../qtwebengine-everywhere-src-6.3.2/src/3rdparty/chromium/third_party/node/node.py", line 57, in RunNode
    raise RuntimeError('Command \'%s\' failed\n%s' % (' '.join(cmd), err))
RuntimeError: Command '/usr/bin/node ../../../../../qtwebengine-everywhere-src-6.3.2/src/3rdparty/chromium/third_party/devtools-frontend/src/scripts/build/compress_files.js --file_list __third_party_devtools-frontend_src_compress__build_qt6-webengine_src_build_src_core_target_toolchain_target__rule..rsp' failed

This is presumably knitting together some documentation, node is currently broken on Arch32..

310PackagesBug ReportMediumLow[webkit2gtk] needs a running RubyNew
0%
Task Description
<internal:/usr/lib/ruby/3.0.0/rubygems/core_ext/kernel_require.rb>:85:in `require': cannot load such file -- date_core (LoadError)
        from <internal:/usr/lib/ruby/3.0.0/rubygems/core_ext/kernel_require.rb>:85:in `require'
        from /usr/lib/ruby/3.0.0/date.rb:4:in `<top (required)>'
        from <internal:/usr/lib/ruby/3.0.0/rubygems/core_ext/kernel_require.rb>:85:in `require'
        from <internal:/usr/lib/ruby/3.0.0/rubygems/core_ext/kernel_require.rb>:85:in `require'
        from /build/webkit2gtk/src/webkitgtk-2.38.2/Source/JavaScriptCore/generator/GeneratedFile.rb:24:in `<top (required)>'
        from /build/webkit2gtk/src/webkitgtk-2.38.2/Source/JavaScriptCore/generator/DSL.rb:25:in `require_relative'
        from /build/webkit2gtk/src/webkitgtk-2.38.2/Source/JavaScriptCore/generator/DSL.rb:25:in `<top (required)>'
        from /build/webkit2gtk/src/webkitgtk-2.38.2/Source/JavaScriptCore/generator/main.rb:24:in `require_relative'
        from /build/webkit2gtk/src/webkitgtk-2.38.2/Source/JavaScriptCore/generator/main.rb:24:in `<main>'

And ruby is currently broken..

311PackagesBug ReportMediumLow[ffmpeg] fails with SIGILL on i686Assigned
0%
Task Description

work fine on pentium4

reproducable: ffplay <file.mp4>

offending opcode:

 0xb5f315e7:  f3 0f 10 83 d0 0b 00 00 movss  
                  0xbd0(%ebx),%xmm0
313PackagesBug ReportMediumLow[hg] broken on i486New
0%
Task Description
Traceback (most recent call last):
  File "/usr/bin/hg", line 59, in <module>
    dispatch.run()
  File "/usr/lib/python3.10/site-packages/mercurial/dispatch.py", line 143, in run
    status = dispatch(req)
  File "/usr/lib/python3.10/site-packages/mercurial/dispatch.py", line 232, in dispatch
    status = _rundispatch(req)
  File "/usr/lib/python3.10/site-packages/mercurial/dispatch.py", line 276, in _rundispatch
    ret = _runcatch(req) or 0
  File "/usr/lib/python3.10/site-packages/mercurial/dispatch.py", line 451, in _runcatch
    return _callcatch(ui, _runcatchfunc)
  File "/usr/lib/python3.10/site-packages/mercurial/dispatch.py", line 461, in _callcatch
    return scmutil.callcatch(ui, func)
  File "/usr/lib/python3.10/site-packages/mercurial/scmutil.py", line 153, in callcatch
    return func()
  File "/usr/lib/python3.10/site-packages/mercurial/dispatch.py", line 441, in _runcatchfunc
    return _dispatch(req)

That’s why ‘nss’ is not rebuilding on i486.

319PackagesBug ReportMediumLow[js102] rebuild results in a broken JS interpreter outp...New
0%
Task Description
 2:33.16 1 warning generated.
 2:47.25     Finished release [optimized] target(s) in 2m 24s
 3:50.23 js/src/build/libjs_static.a
 3:50.23 js/src/build/libmozjs-102.so
 3:51.27 js/src/gdb/gdb-tests
 3:51.27 js/src/shell/js
 3:51.33 js/src/jsapi-tests/jsapi-tests
 3:52.83 ./spidermonkey_checks.stub
 3:54.52 TEST-PASS | check_spidermonkey_style.py | ok
 3:54.79 TEST-PASS | check_macroassembler_style.py | ok
 3:54.84 TEST-PASS | check_js_opcode.py | ok
 3:55.04 7 compiler warnings present.
 3:55.09 Overall system resources - Wall time: 233s; CPU: 0%; Read bytes: 0; Write bytes: 0; Read time: 0; Write time: 0
 3:55.13 warning: intl/icu/source/i18n/nfsubs.cpp:1313:17 [-Wunused-but-set-variable] variable 'pow' set but not used
 3:55.13 warning: intl/icu/source/i18n/ucol.cpp:108:12 [-Wdeprecated-declarations] 'ucol_safeClone_71' is deprecated
 3:55.13 warning: mfbt/tests/TestResult.cpp:101:20 [-Wdeprecated-declarations] 'is_literal_type_v<mozilla::Result<int *, Failed>>' is deprecated
 3:55.13 warning: mfbt/tests/TestResult.cpp:102:20 [-Wdeprecated-declarations] 'is_literal_type_v<mozilla::Result<mozilla::Ok, Failed>>' is deprecated
 3:55.13 warning: mfbt/tests/TestResult.cpp:103:20 [-Wdeprecated-declarations] 'is_literal_type_v<mozilla::Result<mozilla::Ok, Foo8>>' is deprecated
 3:55.13 warning: mfbt/tests/TestResult.cpp:104:20 [-Wdeprecated-declarations] 'is_literal_type_v<mozilla::Result<Foo8, Foo16>>' is deprecated
 3:55.13 warning: mfbt/tests/TestResult.cpp:105:21 [-Wdeprecated-declarations] 'is_literal_type_v<mozilla::Result<mozilla::Ok, mozilla::UniquePtr<int>>>' is deprecated
 3:55.13 Your build was successful!
 Config object not found by mach.
Configure complete!
Be sure to run |mach build| to pick up any changes
To view resource usage of the build, run |mach resource-usage|.
To take your build for a test drive, run: |mach run|
Profiling instrumented JS...
/startdir/PKGBUILD: line 154:  6398 Segmentation fault      (core dumped) "$js" run.js
320PackagesBug ReportMediumLow[btop] On i486 fails on clock_gettime64New
0%
Task Description

shows a red ERROR: on startup, strace shows:

write(2, "\n", 1
)                       = 1
clock_gettime64(CLOCK_REALTIME, {tv_sec=1675495215, tv_nsec=436798535}) = 0
exit_group(1)                           = ?
+++ exited with 1 +++
[root@eurobuild6-7-i486 ~]# btop
ERROR: No UTF-8 locale detected!
321PackagesBug ReportMediumLow[gnome] brokenAssigned
0%
Task Description

mutter had a checksum issue (trivial).

gnome-shell misses a current version of gjs:

Dependency gjs-1.0 found: NO found 1.70.2 but need: '>= 1.73.1'
Did not find CMake 'cmake'
Found CMake: NO
Run-time dependency gjs-1.0 found: NO 

gnome-shell/meson.build:80:0: ERROR: Dependency lookup for gjs-1.0 with method 'pkgconfig' failed: Invalid version, need 'gjs-1.0' ['>= 1.73.1'] found '1.70.2'.

A full log can be found at /build/gnome-shell/src/build/meson-logs/meson-log.txt
326PackagesBug ReportMediumLow[php] needs a rebuildNew
0%
Task Description

httpd/conf/httpd.conf: Cannot load modules/libphp.so into server: libssl.so.1.1>

337PackagesBug ReportMediumLowpackages are being downgraded in reposNew
0%
Task Description

warning: filesystem: local (2023.09.18-1.0) is newer than core (2023.01.31-1.0)

348PackagesBug ReportMediumLowopenssl failing testsNew
0%
Task Description
30-test_aesgcm.t ........................ ok                                                                ������������������������������������������������������������������                                                                                             

ALG_PERR: engines/e_afalg.c(463): Failed to bind socket : No such file or directory                         �����������������������������������������������������������������������������������������������������������������������������                                                                                   
        # ERROR: (bool) 'EVP_CipherInit_ex(ctx, cipher, e, key, iv, 1) == true' failed @ test/afalgtest.c   ������������������������������������������������������������������������������������������������������������������������������������������������������������c                                                                             :85                                                                                                         �����           
        # false                                                                                             �����������������������                                                        
        # 00000000:error:40000067:lib(128)::socket bind failed:engines/e_afalg.c:464:                       ������������������������������������������������������������������������������������������������������������������������������:                                                                                  
        # OPENSSL_TEST_RAND_SEED=1707239178                                                                 �����������������������������������������������������������������                                                                                             
        not ok 1 - iteration 1                                                                              ������������������������������������������ㄠ                                                                                                
# ------------------------------------------------------------------------------                            ������������������������������������������������������������������������������������������������������������������������                                                                                    
ALG_PERR: engines/e_afalg.c(463): Failed to bind socket : No such file or directory                         �����������������������������������������������������������������������������������������������������������������������������                                                                                   
        # ERROR: (bool) 'EVP_CipherInit_ex(ctx, cipher, e, key, iv, 1) == true' failed @ test/afalgtest.c   ������������������������������������������������������������������������������������������������������������������������������������������������������������c                                                                             :85                                                                                                         �����           
        # false                                                                                             �����������������������                                                        
        # 00000000:error:40000067:lib(128)::socket bind failed:engines/e_afalg.c:464:                       ������������������������������������������������������������������������������������������������������������������������������:                                                                                  
        # OPENSSL_TEST_RAND_SEED=1707239178                                                                 �����������������������������������������������������������������                                                                                             
        not ok 2 - iteration 2                                                                              ������������������������������������������㈠                                                                                                
# ------------------------------------------------------------------------------                            ������������������������������������������������������������������������������������������������������������������������                                                                                    
ALG_PERR: engines/e_afalg.c(463): Failed to bind socket : No such file or directory                         �����������������������������������������������������������������������������������������������������������������������������                                                                                   
        # ERROR: (bool) 'EVP_CipherInit_ex(ctx, cipher, e, key, iv, 1) == true' failed @ test/afalgtest.c   ������������������������������������������������������������������������������������������������������������������������������������������������������������c                                                                             :85                                                                                                         �����           
        # false                                                                                             �����������������������                                                        
        # 00000000:error:40000067:lib(128)::socket bind failed:engines/e_afalg.c:464:                       ������������������������������������������������������������������������������������������������������������������������������:                                                                                  
        # OPENSSL_TEST_RAND_SEED=1707239178                                                                 �����������������������������������������������������������������                                                                                             
        not ok 3 - iteration 3                                                                              ������������������������������������������㌠                                                                                                
# ------------------------------------------------------------------------------                            ������������������������������������������������������������������������������������������������������������������������                                                                                    
    # OPENSSL_TEST_RAND_SEED=1707239178                                                                     �����������������������������������������������������������                                                                                              
    not ok 1 - test_afalg_aes_cbc                                                                           ������������������������������������������������c                                                                                               
# ------------------------------------------------------------------------------                            ������������������������������������������������������������������������������������������������������������������������                                                                                    
../../util/wrap.pl ../../test/afalgtest => 1                                                                ������������������������������������������������������������������                                                                                             
not ok 1 - running afalgtest                                                                                ������������������������������������������                                                                                                 

349PackagesBug ReportMediumLowtop print "get_mempolicy: Function not implemented" on ...New
0%
Task Description

no task description

355PackagesBug ReportMediumCriticalKDE packages fail to install because of /libNew
0%
Task Description

Some KDE packages try to replace the ‘lib’ symlink with a directory, causing the system
to fail to start.

If you are lucky, pacman warns you about it and says:

pacman -S breeze-icons
resolving dependencies...
looking for conflicting packages...

Packages (1) breeze-icons-6.0.0-1.0

Total Installed Size:  71.92 MiB
Net Upgrade Size:       0.61 MiB

:: Proceed with installation? [Y/n] 
(1/1) checking keys in keyring                                  [##################################] 100%
(1/1) checking package integrity                                [##################################] 100%
(1/1) loading package files                                     [##################################] 100%
(1/1) checking for file conflicts                               [##################################] 100%
error: failed to commit transaction (conflicting files)
breeze-icons: /lib exists in filesystem (owned by filesystem)
Errors occurred, no packages were upgraded

I had one hard-to-reproduce case where I basically nuked my VMs with that.

The recovery procedure in this case is:

# Boot from last ISO
# mount /dev/xxx to /mnt
cd /usr
mv lib/cmake/* usr/lib/cmake/.
mv lib/qml /usr/lib/.
rmdir lib/cmake
rmdir lib
ln -s usr/lib lib

Packages known to misbehave are ‘kqtquickcharts’, ‘breeze-icons’. Surely more to follow..

 93 Packages: StableBug ReportVery LowMedium pyparsing error is preventing applications from startin ...Closed
100%
Task Description

Came across this after completing a system update two days ago.

I run Radicale and that is refusing to start with the following error:

Traceback (most recent call last):
  File "/usr/bin/radicale", line 6, in <module>
    from pkg_resources import load_entry_point
  File "/usr/lib/python3.7/site-packages/pkg_resources/__init__.py", line 84, in <module>
    __import__('packaging.requirements')
  File "/usr/lib/python3.7/site-packages/packaging/requirements.py", line 9, in <module>
    from pyparsing import stringStart, stringEnd, originalTextFor, ParseException
ModuleNotFoundError: No module named 'pyparsing'

When attempting to run pip to see if that might correct the issue, I got the following error:

Traceback (most recent call last):
  File "/usr/bin/pip", line 6, in <module>
    from pkg_resources import load_entry_point
  File "/usr/lib/python3.7/site-packages/pkg_resources/__init__.py", line 84, in <module>
    __import__('packaging.requirements')
  File "/usr/lib/python3.7/site-packages/packaging/requirements.py", line 9, in <module>
    from pyparsing import stringStart, stringEnd, originalTextFor, ParseException
ModuleNotFoundError: No module named 'pyparsing'

It looks as though something recently broke pyparsing and that’s had a knockon effect for a few packages.

 95 Packages: StableBug ReportVery LowHigh KDE broken since KDE Frameworks 5.64 update Closed
100%
Task Description

KDE applications fail to start with the following error:

symbol lookup error: /usr/lib/libKF5QuickAddons.so.5: undefined symbol: _ZNK19KCoreConfigSkeleton10isDefaultsEv

The affected applications I’ve found so far are:
dolphin 19.08.3-1.0
kwin 5.17.3-1.0
plasma-workspace 5.17.0-2.0

After downgrading kdeclarative to 5.63.0-1.0 kwin and plasma start but dolphin fails with a new error:

dolphin: symbol lookup error: /usr/lib/libKF5KCMUtils.so.5: undefined symbol: _ZNK12KQuickAddons12ConfigModule11errorStringEv

Downgrading kcmutils to 5.63.0-1.0 finally fixed dolphin.

 97 Packages: StableBug ReportVery LowLow mesa-vdpau /usr/lib/dri/r300_dri.so links to wrong libL ...Closed
100%
Task Description
grep LLVM /var/log/Xorg.0.log
[    29.423] (EE) AIGLX error: dlopen of /usr/lib/dri/r300_dri.so failed (libLLVM-8.so: cannot open shared object file: No such file or directory)
[    29.424] (EE) AIGLX error: dlopen of /usr/lib/dri/swrast_dri.so failed (libLLVM-8.so: cannot open shared object file: No such file or directory)
ldd /usr/lib/dri/r300_dri.so 
        linux-gate.so.1 (0xb7f26000)
        libdrm.so.2 => /usr/lib/libdrm.so.2 (0xb6836000)
        libLLVM-8.so => not found
        libexpat.so.1 => /usr/lib/libexpat.so.1 (0xb680a000)
        libdl.so.2 => /usr/lib/libdl.so.2 (0xb6804000)
        libsensors.so.5 => /usr/lib/libsensors.so.5 (0xb67f3000)
        libdrm_radeon.so.1 => /usr/lib/libdrm_radeon.so.1 (0xb67e4000)
        libelf.so.1 => /usr/lib/libelf.so.1 (0xb67c6000)
        libdrm_amdgpu.so.1 => /usr/lib/libdrm_amdgpu.so.1 (0xb67b9000)
        libdrm_nouveau.so.2 => /usr/lib/libdrm_nouveau.so.2 (0xb67ae000)
        libglapi.so.0 => /usr/lib/libglapi.so.0 (0xb678d000)
        libz.so.1 => /usr/lib/libz.so.1 (0xb6773000)
        libstdc++.so.6 => /usr/lib/libstdc++.so.6 (0xb6595000)
        libm.so.6 => /usr/lib/libm.so.6 (0xb64c3000)
        libgcc_s.so.1 => /usr/lib/libgcc_s.so.1 (0xb64a6000)
        libpthread.so.0 => /usr/lib/libpthread.so.0 (0xb6483000)
        libc.so.6 => /usr/lib/libc.so.6 (0xb62d3000)
        /usr/lib/ld-linux.so.2 (0xb7f27000)
ls /usr/lib/libLLVM*
/usr/lib/libLLVM-9.0.0.so  /usr/lib/libLLVM-9.so  /usr/lib/libLLVM.so
 107 PackagesBug ReportVery LowLow wireguard-dkms-0.0.20200318-1.0 does not build with 5.5 ...Closed
100%
Task Description

Installing wireguard-dkms fails with:

(2/2) Install DKMS modules
==> dkms install wireguard/0.0.20200318 -k 5.5.8-arch1-1.0
Error! Bad return status for module build on kernel: 5.5.8-arch1-1.0 (i686)
Consult /var/lib/dkms/wireguard/0.0.20200318/build/make.log for more information.

The file /var/lib/dkms/wireguard/0.0.20200318/build/make.log contains the following messages:

DKMS make.log for wireguard-0.0.20200318 for kernel 5.5.8-arch1-1.0 (i686)
Fri 03 Apr 2020 10:11:21 PM CEST
make: Entering directory '/usr/lib/modules/5.5.8-arch1-1.0/build'
  AR      /var/lib/dkms/wireguard/0.0.20200318/build/built-in.a
  CC [M]  /var/lib/dkms/wireguard/0.0.20200318/build/main.o
cc1: error: incompatible gcc/plugin versions
cc1: error: fail to initialize plugin ./scripts/gcc-plugins/structleak_plugin.so
make[1]: *** [scripts/Makefile.build:266: /var/lib/dkms/wireguard/0.0.20200318/build/main.o] Error 1
make: *** [Makefile:1693: /var/lib/dkms/wireguard/0.0.20200318/build] Error 2
make: Leaving directory '/usr/lib/modules/5.5.8-arch1-1.0/build'
 110 PackagesBug ReportVery LowLow [syslog-ng] is built without systemd support Closed
100%
Task Description

The packages for syslog-ng since version 3.27.1-1.0 appears to have been built without systemd support. Although their PKGBUILD runs configure with –enable-systemd, running syslog-ng –version shows Enable-Systemd: off. The official Arch x86_64 package (at version 3.28.1-1) doesn’t exhibit this problem.

I tried building the package locally on i686 using the official Arch PKGBUILD and could not reproduce the problem. My locally built version correctly finds libsystemd during configure, and gets built with systemd support. This leads me to believe the problem happens somewhere in the Archlinux32 build process.


The practical upshot of the problem is that the systemd unit file supplied with syslog-ng lists it as a Type=notify service, but when it fails to notify systemd after startup, systemd eventually kills it and restarts it repeatedly:

Jul 24 07:32:31 wolfie systemd[1]: Starting System Logger Daemon "default" instance...
Jul 24 07:32:32 wolfie syslog-ng[18977]: syslog-ng starting up; version='3.28.1'
Jul 24 07:34:01 wolfie systemd[1]: syslog-ng@default.service: start operation timed out. Terminating.
Jul 24 07:34:01 wolfie syslog-ng[18977]: syslog-ng shutting down; version='3.28.1'
Jul 24 07:34:01 wolfie systemd[1]: syslog-ng@default.service: Failed with result 'timeout'.
Jul 24 07:34:01 wolfie systemd[1]: Failed to start System Logger Daemon "default" instance.
Jul 24 07:34:02 wolfie systemd[1]: syslog-ng@default.service: Scheduled restart job, restart counter is at 1.
Jul 24 07:34:02 wolfie systemd[1]: Stopped System Logger Daemon "default" instance.
Jul 24 07:34:02 wolfie systemd[1]: Starting System Logger Daemon "default" instance...
 111 PackagesBug ReportVery LowHigh [libxcrypt]: conflicts with glibc Closed
100%
Task Description
# pacman -Syu
....
error: failed to commit transaction (conflicting files)
libxcrypt: /usr/include/crypt.h exists in filesystem (owned by glibc)
libxcrypt: /usr/lib/libcrypt.so exists in filesystem (owned by glibc)
Errors occurred, no packages were upgraded.

this is a rather critical bug - it is required by gtk and qt, via libcups; so most desktop users are affected by it

 112 PackagesBug ReportVery LowLow [lxpanel]: segfaults on startup Closed
100%
Task Description

# pacman -Sy lxde
reboot and start lxsession
lxpanel will crash immediately, with this error in dmesg

pcmanfm[501]: segfault at 2d ip b74823cf sp bf9dd0d0 error 4 in libpango-1.0.so.0.4600.0[b7466000+29000]

lxpanel does not have this problem with GTK3
# pacman -Sy lxde-gtk3
works as expectd

 113 PackagesBug ReportVery LowLow [leafpad]: segfaults Closed
100%
Task Description

start leafpad
everything looks fine
type or paste anything and it segfaults with this error in dmesg

leafpad[550]: segfault at 1 ip b77adf13 sp bfd0eaec error 4 in libgobject-2.0.so.0.6400.3[b7787000+2f000]
 114 Packages: StableBug ReportVery LowMedium Kmail: symbol lookup error Closed
100%
Task Description

Kmail 20.08.1-1.0 fails to start with symbol lookup error.

Steps to reproduce: invoking kmail on the console shows:

kmail: symbol lookup error: /usr/lib/libKF5MailImporter.so.5: undefined symbol: _ZN9PimCommon15CustomLogWidgetC1EP7QWidget

Downgrading messagelib fixes this issue but generates other issues (missing files or other undefined symbols).

After all I didn’t find a solution.

 118 PackagesBug ReportVery LowMedium signing key is expired Closed
100%
Task Description

When trying to install the package, packman complies about the the key to be of unknown trust. Cheking the keyring the associated key appers to be expired.

 119 PackagesBug ReportVery LowHigh [gdb] needs rebuilt after python upgrade Closed
100%
Task Description

Pacman recently upgraded python from 3.8 to 3.9, which breaks the gdb package:

% gdb
gdb: error while loading shared libraries: libpython3.8.so.1.0: cannot open shared object file: No such file or directory
 120 PackagesBug ReportVery LowLow Princeton ArchLinux32 mirror has been out of date; ques ...Closed
100%
Task Description

The ArchLinux32 mirror at http[s]://mirror.math.princeton.edu/pub/archlinux32/ appears to have stopped syncing properly in October. I contacted web@math.princeton.edu on January 1 to alert them to the problem, and received the following response from a Princeton sysadmin:


Here is the configuration I am using:
archlinux32:
   remotesrc: “rsync://mirror.archlinux32.org/archlinux32/”
   localdest: “/var/www/html/pub/archlinux32”
   extraopts: “–port=22873”
Looks like at some point this stopped working from upstream:
Raw standard error:
rsync: failed to connect to mirror.archlinux32.org (85.10.198.216): Connection refused (111)
rsync: failed to connect to mirror.archlinux32.org (2a01:4f8:a0:5264::2): Network is unreachable (101)
rsync error: error in socket IO (code 10) at clientserver.c(125) [Receiver=3.1.2]
Can you recommend a better upstream target I can use? And if there are additional constraints on checkin time or frequency.

I informed him that I am not an official member of the ArchLinux32 team, but suggested that using the regular rsync port of 873 might work as mirror.archlinux32.org appears to accept connections to that port from the Internet. As of the time of this writing, it appears that the mirror is now again up to date (although it has other issues returning HTTP error 403 for some of its files), but I promised to bring his additional questions to the official team.

So, to iterate, is this the appropriate target to mirror, or should they use some other parameters?

Thank you.

 121 PackagesBug ReportVery LowHigh Multiple packages need rebuild after libicu upgrade Closed
100%
Task Description

Over in  FS#119 , @abaumann mentioned that the libicu upgrade from 67 to 68 was part of what broke gdb. I missed the libicu upgrade when looking at gdb, but now that that one is resolved, I noticed a number of other packages that still link against the old and now nonexistant /usr/lib/libicu*.so.67 files. On my particular system, the following packages are installed, link to icu 67, and need rebuilt as well:

* harfbuzz-icu (2.7.0-1.0)
* mongo-c-driver (1.17.3-1.0)
* postfix (3.5.6-2.0)
* postgresql (12.4-1.0)
* postgresql-old-upgrade (12.5-1.0)
* samba (4.12.3-1.2)
* smbclient (4.12.3-1.2)
* syslog-ng (3.28.1-3.0)
* texlive-bin (2020.54586-4.0)
* xfsprogs (5.8.0-1.0)

… but I’m sure you have a way of determining all the affected packages?

As a workaround, in case others have the same problem, I manually extracted the old versioned .so files from the previous package to get things working again:

```
tar -C / -xf /var/cache/pacman/pkg/icu-67.1-1.0-i686.pkg.tar.zst –wildcards ‘usr/lib/lib*.so.*’ ```

- I’ll just have to remember to clean them up again later.

 122 PackagesBug ReportVery LowLow Permissions bits on files on the primary mirror are too ...Closed
100%
Task Description

In my quest to find a working mirror close to me, I’ve come across another issue with at least a couple of mirrors. Some mirrors respond with a HTTP 403 Forbidden for certain files, notably many of the Pacman database files. At the time of this writing, I’m aware of this problem happening with the princeton.edu and the clarkson.edu mirrors. I’ve been in contact with the admin of one of the mirrors, and they’ve pointed out that the permission bits are set to 0600 at the source. If the primary mirror could have their files be world readable, it would likely fix this problem automatically across more than one mirror.

Is that something we can do?

Steps to verify:

1. Access certain files from the primary mirror using rsync, for example:

% rsync -av rsync://mirror.archlinux32.org/archlinux32/i686/extra/extra.db.tar.gz .
receiving incremental file list
extra.db.tar.gz

sent 43 bytes  received 2,044,453 bytes  371,726.55 bytes/sec
total size is 2,043,851  speedup is 1.00

2. Examine permission bits:

% ls -l extra.db.tar.gz
-rw------- 1 user user 2043851 Jan  8 11:51 extra.db.tar.gz

Should be -rw-r–r–.

 134 PackagesBug ReportVery LowLow arm-none-eabi-gdb requires rebuild Closed
100%
Task Description

arm-none-eabi-gdb is broken due to not satisfiable dependency: “libpython3.8.so.1.0” After recompiling from upstream it works.

 167 Packages: StableBug ReportVery LowMedium Kernel lost crypto support necessary for iwd Closed
100%
Task Description

With linux 5.11.1.arch1-1.0, iwd no longer works for associating with WPA2 access points. On attempting to start the service, the journal reads:

iwd: RC4 support not found
iwd: The following options are missing in the kernel:
iwd:    CONFIG_CRYPTO_USER_API_SKCIPHER
iwd:    CONFIG_CRYPTO_ECB
iwd:    CONFIG_CRYPTO_ARC4

It would be nice to have these options enabled in the kernel config, so as to continue support for the iwd package.

 169 PackagesFeature RequestVery LowLow New mirror: mirror.nw-sys.ru Closed
100%
Task Description

I didn’t found any message about reporting new mirrors of archlinux32 project, so I decided to open new FR. Sorry if I mistaken and show me the right way, please :)

Domain name: mirror.nw-sys.ru
Country: Russia
Supported access methods for mirror:
http(s) - http(s)://mirror.nw-sys.ru/archlinux32/
rsync - rsync://mirror.nw-sys.ru/archlinux32
Mirror bandwidth - 100 Mbit/s almostly, with slight slowdowns around the day.
Primary administrative contact - no1@no1sg.ru
Alternative administrative contact - morgan29rus@gmail.com
Source mirror - mirror.archlinux32.org

 170 PackagesBug ReportVery LowLow [libarchive] zstd minimum version dependency - zstd>=1. ...Closed
100%
Task Description

libarchive has a dependency upon the zstd libzstd with a version recent enough to provide the symbol ZSTD_minCLevel.

PKGBUILD:
depends=(... 'zstd>=1.3.6')

This is an issue when upgrading pacman to support the zstd packaging format.
pacman must depend upon libarchive>=3.3.3 for zstd compression support.
libarchive will then depend upon zstd>=1.3.6 for the symbol ZSTD_minCLevel.

Without these, upgrading an old Arch Linux system gives the incomplete - so unhelpful - error message:

error: could not open file /var/cache/pacman/pkg/something.pkg.tar.zst: Unrecognized archive format

How does pacman recognize an archive format? If the user does not already know the answer, they are in trouble. And, mistakenly circumventing the package compression to force an upgrade of pacman alone will lead to even more trouble, since pacman itself is not the source of the problem.

 171 PackagesBug ReportVery LowLow [pacman] libarchive minimum version dependency - libarc ...Closed
100%
Task Description

pacman has a dependency upon libarchive with a version recent enough to support zstd compression.

depends=(... 'libarchive>=3.3.3')

This is an issue when upgrading pacman to support the zstd packaging format.
pacman must depend upon libarchive>=3.3.3 for zstd compression support.
libarchive will then depend upon zstd>=1.3.6 for the symbol ZSTD_minCLevel.

Without these, upgrading an old Arch Linux system gives the incomplete - so unhelpful - error message:

error: could not open file /var/cache/pacman/pkg/something.pkg.tar.zst: Unrecognized archive format

How does pacman recognize an archive format? If the user does not already know the answer, they are in trouble. And, mistakenly circumventing the package compression to force an upgrade of pacman alone will lead to even more trouble, since pacman itself is not the source of the problem.

 173 PackagesBug ReportVery LowMedium supertux is broken (depends on libboostfilesystem 0.72  ...Closed
100%
Task Description

Supertux needs to be rebuilt as it currently depends on the wrong version of libboostfilesystem.

https://www.archlinux32.org/packages/i686/community/supertux/ not satisfiable dependency: “libboost_filesystem.so.1.72.0” (link)
not satisfiable dependency: “libboost_locale.so.1.72.0” (link)

This affects all architectures (i686 and pentium4)

 175 PackagesBug ReportVery LowLow [pango]: symbol lookup error: /usr/lib/libpango-1.0.so. ...Closed
100%
Task Description

this is a rather severe bug - it prevents GTK DMs, DEs, and programs from starting (lightdm, lxdm, lxde, leafpad)

the error is evident immediately in the pacman log - see: http://termbin.com/vezp

g_module_open() failed for /usr/lib/gdk-pixbuf-2.0/2.10.0/loaders/libpixbufloader-svg.so: /usr/lib/libpango-1.0.so.0: undefined symbol: g_memdup2
/usr/bin/gtk-query-immodules-3.0: symbol lookup error: /usr/lib/libpango-1.0.so.0: undefined symbol: g_memdup2

if you disable the DM service, you can get the same error by launching the DE directly

$ startlxde
/usr/bin/lxsession: symbol lookup error: /usr/lib/libpango-1.0.so.0: undefined symbol: g_memdup2
 178 DevopsBug ReportVery LowLow New installer overwrites pacman mirrors Closed
100%
Task Description

I tried to install archlinux32 using the archinstall installer, which is shipped with the installation medium.
Installation is working fine until pacstrap, where it will crash because all mirrors will return 404. I checked
my connection and it is working and dns also works. When I viewed the /etc/pacman.d/mirrorlist file, I saw that the script
wrote the default archlinux mirrors for the region specified in the installer to the file and the don’t contain the 32bit packages.

 179 Packages: StableBug ReportVery LowMedium Snapper needs rebuild from icu upgrade Closed
100%
Task Description

icu69.1-1.0 however snapper still links against libicuuc.so.68

Running snapper now gives the following error:

# snapper list /
snapper: error while loading shared libraries: libicuuc.so.68: cannot open shared object file: No such file or directory
 180 Packages: StableBug ReportVery LowLow Pandoc requires specific-version haskell dependencies Closed
100%
Task Description
# pandoc --version
pandoc: error while loading shared libraries: libHSzip-archive-0.4.1-4yLWnBS0zifKkvfHVbmUo1-ghc8.10.2.so: cannot open shared object file: No such file or directory
<code>

Versions:
<code>
# pacman -Q | grep haskell
haskell-aeson 1.5.4.1-19.0
haskell-aeson-pretty 0.8.8-94.0
haskell-ansi-terminal 0.11-17.0
haskell-asn1-encoding 0.9.6-58.0
haskell-asn1-parse 0.9.5-58.0
haskell-asn1-types 0.3.4-37.0
haskell-assoc 1.0.2-27.0
haskell-async 2.2.2-40.0
haskell-attoparsec 0.13.2.4-36.0
haskell-base-compat 0.11.2-4.2
haskell-base-compat-batteries 0.11.2-11.0
haskell-base-orphans 0.8.3-14.0
haskell-base16-bytestring 0.1.1.7-3.0
haskell-base64-bytestring 1.2.0.1-3.0
haskell-basement 0.0.11-10.1
haskell-bifunctors 5.5.8-13.0
haskell-blaze-builder 0.4.2.1-2.1
haskell-blaze-html 0.9.1.2-57.0
haskell-blaze-markup 0.8.2.7-41.0
haskell-byteable 0.1.1-22.1
haskell-case-insensitive 1.2.1.0-39.0
haskell-cereal 0.5.8.1-9.0
haskell-citeproc 0.3.0.9-9.0
haskell-cmdargs 0.10.21-1.0
haskell-colour 2.3.5-75.0
haskell-commonmark 0.1.1.2-2.0
haskell-commonmark-extensions 0.2.0.3-1.0
haskell-commonmark-pandoc 0.2.0.1-24.0
haskell-comonad 5.0.6-58.0
haskell-conduit 1.3.4-3.0
haskell-conduit-extra 1.3.5-70.0
haskell-connection 0.3.1-99.0
haskell-cookie 0.4.5-9.1
haskell-cryptonite 0.27-32.0
haskell-data-default 0.7.1.1-87.0
haskell-data-default-class 0.1.2.0-21.1
haskell-data-default-instances-containers 0.0.1-33.1
haskell-data-default-instances-dlist 0.0.1-100.0
haskell-data-default-instances-old-locale 0.0.1-33.1
haskell-data-fix 0.3.0-35.0
haskell-digest 0.0.1.2-22.1
haskell-distributive 0.6.2-40.0
haskell-dlist 1.0-23.0
haskell-doclayout 0.3-45.0
haskell-doctemplates 0.9-40.0
haskell-emojis 0.1-47.0
haskell-erf 2.0.0.0-21.0
haskell-errors 2.3.0-59.1
haskell-file-embed 0.0.13.0-3.1
haskell-glob 0.10.1-28.0
haskell-haddock-library 1.9.0-58.0
haskell-hashable 1.3.0.0-36.0
haskell-hourglass 0.2.12-82.0
haskell-hslua 1.3.0-2.0
haskell-hslua-module-system 0.2.2.1-17.0
haskell-hslua-module-text 0.3.0.1-5.0
haskell-hsyaml 0.2.1.0-52.0
haskell-http 4000.3.15-49.0
haskell-http-client 0.7.6-14.0
haskell-http-client-tls 0.3.5.3-359.0
haskell-http-types 0.12.3-100.0
haskell-hxt 9.3.1.18-196.0
haskell-hxt-charproperties 9.5.0.0-1.0
haskell-hxt-regex-xmlschema 9.2.0.7-2.0
haskell-hxt-unicode 9.0.2.4-22.0
haskell-indexed-traversable 0.1.1-3.1
haskell-integer-logarithms 1.0.3.1-3.1
haskell-ipynb 0.1.0.1-192.0
haskell-jira-wiki-markup 1.3.2-27.0
haskell-juicypixels 3.3.5-37.0
haskell-memory 0.15.0-49.0
haskell-mime-types 0.1.0.9-11.1
haskell-mono-traversable 1.0.15.1-74.0
haskell-network 3.1.2.1-1.0
haskell-network-uri 2.6.3.0-217.0
haskell-old-locale 1.0.0.7-27.1
haskell-old-time 1.1.0.3-27.1
haskell-pandoc-types 1.22-13.0
haskell-pem 0.2.4-114.0
haskell-primitive 0.7.1.0-29.0
haskell-quickcheck 2.14.2-11.0
haskell-random 1.2.0-54.0
haskell-resourcet 1.2.4.2-31.0
haskell-safe 0.3.19-5.1
haskell-scientific 0.3.6.2-53.0
haskell-sha 1.6.4.4-16.1
haskell-skylighting 0.10.2-24.0
haskell-skylighting-core 0.10.2-24.0
haskell-socks 0.6.1-90.0
haskell-split 0.2.3.4-88.0
haskell-splitmix 0.1.0.3-5.0
haskell-streaming-commons 0.2.2.1-28.1
haskell-strict 0.4.0.1-1.0
haskell-syb 0.7.1-8.0
haskell-tagged 0.8.6.1-2.2
haskell-tagsoup 0.14.8-75.0
haskell-temporary 1.3-130.0
haskell-texmath 0.12.0.3-40.0
haskell-text-conversions 0.3.1-62.0
haskell-text-icu 0.7.0.1-37.1
haskell-th-abstraction 0.4.2.0-2.2
haskell-th-compat 0.1-12.0
haskell-these 1.1.1.1-28.0
haskell-time-compat 1.9.5-1.0
haskell-tls 1.5.5-3.0
haskell-transformers-compat 0.6.6-3.1
haskell-typed-process 0.2.6.0-63.0
haskell-unicode-transforms 0.3.7.1-42.0
haskell-uniplate 1.6.13-4.0
haskell-unliftio-core 0.2.0.1-6.1
haskell-unordered-containers 0.2.13.0-11.0
haskell-utf8-string 1.0.1.1-20.0
haskell-uuid-types 1.0.3-58.0
haskell-vector 0.12.1.2-64.0
haskell-vector-algorithms 0.8.0.4-1.0
haskell-x509 1.7.5-137.0
haskell-x509-store 1.6.7-136.0
haskell-x509-system 1.6.6-204.0
haskell-x509-validation 1.6.11-136.0
haskell-xml 1.3.14-27.2
haskell-xml-conduit 1.9.0.0-77.0
haskell-xml-types 0.3.8-5.1
haskell-zip-archive 0.4.1-66.0
haskell-zlib 0.6.2.2-4.0
 182 Packages: StableBug ReportVery LowLow [blender] cannot resolve dependency to opensubdiv Closed
100%
Task Description

# pacman -S blender resolving dependencies… warning: cannot resolve "opensubdiv”, a dependency of "blender” :: The following package cannot be upgraded due to unresolvable dependencies:

    blender

:: Do you want to skip the above package for this upgrade? [y/N]
error: failed to prepare transaction (could not satisfy dependencies)
:: unable to satisfy dependency 'opensubdiv’ required by blender

 183 PackagesBug ReportVery LowLow [gedit] error loading shared library libtepl-5.so.0 Closed
100%
Task Description

$ gedit
gedit: error while loading shared libraries: libtepl-5.so.0: cannot open shared object file: No such file or directory

Exist extra/tepl 6.00.0-1.0 in the pacman.
I’m not sure if gedit is old or can only be used with an older version of tepl, which is not possible because i get tepl from 3 days.

 184 Packages: StableBug ReportVery LowLow [ffmpeg] error loading share library libaom.so.2 Closed
100%
Task Description

$ ffmpeg -v
ffmpeg: error while loading shared libraries: libaom.so.2: cannot open shared object file: No such file or directory

From pacman:
extra/aom 3.0.0-2.1 [installed]

 190 Packages: StableBug ReportVery LowCritical mpv-1:0.33.1-2.0-pentium4 aborts immediately Closed
100%
Task Description

Here’s 1:0.33.1-1.0-pentium4:

$ pacman -Qs mpv
local/mpv 1:0.33.1-1.0
    a free, open source, and cross-platform media player

$ mpv --version
mpv 0.33.1-dirty Copyright © 2000-2020 mpv/MPlayer/mplayer2 projects
 built on UNKNOWN
FFmpeg library versions:
   libavutil       56.51.100
   libavcodec      58.91.100
   libavformat     58.45.100
   libswscale      5.7.100
   libavfilter     7.85.100
   libswresample   3.7.100
FFmpeg version: n4.3.2

Here’s 1:0.33.1-2.0-pentium4:

$ pacman -Qs mpv
local/mpv 1:0.33.1-2.0
    a free, open source, and cross-platform media player

$ mpv --msg-level=all=trace --version
libavutil: 56.70.100 -> 56.51.100
Aborted (core dumped)

Looks to me like it might be a library version thing (I’m up-to-date according to

pacman -Syu

), but I’ve only been running Arch32 for 24 hours so I’m not sure where further to dig.

 191 PackagesBug ReportVery LowCritical mpv links against libsrt.so.1 which does not exist Closed
100%
Task Description
$ pacman -Qs mpv
local/mpv 1:0.33.1-1.0
    a free, open source, and cross-platform media player
$ pacman -Qs srt
local/srt 1.4.3-1.0
    Secure Reliable Transport library
$ pacman -Fl srt | grep libsrt
srt usr/lib/libsrt.so
srt usr/lib/libsrt.so.1.4
srt usr/lib/libsrt.so.1.4.3
$ mpv
mpv: error while loading shared libraries: libsrt.so.1: cannot open shared object file: No such file or directory
$ ldd /usr/bin/mpv | grep srt
	libsrt.so.1 => not found
$ sudo ln -s /usr/lib/libsrt.so.1.4.3 /usr/lib/libsrt.so.1
$ mpv --version
mpv 0.33.1-dirty Copyright © 2000-2020 mpv/MPlayer/mplayer2 projects
 built on UNKNOWN
FFmpeg library versions:
   libavutil       56.51.100
   libavcodec      58.91.100
   libavformat     58.45.100
   libswscale      5.7.100
   libavfilter     7.85.100
   libswresample   3.7.100
FFmpeg version: n4.3.2

$ ldd /usr/bin/mpv | grep srt
	libsrt.so.1 => /usr/lib/libsrt.so.1 (0xb2a54000)

Running ldconfig does not create the missing symlink.

 192 PackagesBug ReportVery LowHigh [postgis] not satisfiable dependency: "libproj.so.22" Closed
100%
Task Description

The postgis package version 3.1.1-1.0 on pentium4 does not work because only
libproj-1.5.so is installed, and not the required libproj-2.2.so.

On upstream there seems to have been some rebuild of newer versions of gdal 3.2.2 and proj 8.0.0:
https://archlinux.org/todo/gdal-322-and-proj-800-rebuild/

 194 PackagesBug ReportVery LowLow go 1.16 doesn't build. Closed
100%
Task Description

The go build fails with this error:

unsupported setting GO386=387. Consider using GO386=softfloat instead.

go tool dist: FAILED: /build/go/src/go/pkg/tool/linux_386/compile -std -pack -o /tmp/go-tool-dist-250139381/runtime/internal/atomic/_go_.a -p runtime/internal/atomic -importcfg /tmp/go-tool-dist-250139381/runtime/internal/atomic/importcfg -asmhdr /tmp/go-tool-dist-250139381/runtime/internal/atomic/go_asm.h -symabis /tmp/go-tool-dist-250139381/runtime/internal/atomic/symabis /build/go/src/go/src/runtime/internal/atomic/atomic_386.go /build/go/src/go/src/runtime/internal/atomic/stubs.go /build/go/src/go/src/runtime/internal/atomic/unaligned.go: exit status 1
go tool dist: open /tmp/go-tool-dist-250139381/runtime/internal/atomic/_go_.a: no such file or directory
go tool dist: open /tmp/go-tool-dist-250139381/runtime/internal/sys/_go_.a: no such file or directory
go tool dist: open /tmp/go-tool-dist-250139381/internal/cpu/_go_.a: no such file or directory
unsupported setting GO386=387. Consider using GO386=softfloat instead.

go tool dist: FAILED: /build/go/src/go/pkg/tool/linux_386/compile -std -pack -o /tmp/go-tool-dist-250139381/internal/cpu/_go_.a -p internal/cpu -importcfg /tmp/go-tool-dist-250139381/internal/cpu/importcfg -asmhdr /tmp/go-tool-dist-250139381/internal/cpu/go_asm.h -symabis /tmp/go-tool-dist-250139381/internal/cpu/symabis /build/go/src/go/src/internal/cpu/cpu.go /build/go/src/go/src/internal/cpu/cpu_386.go /build/go/src/go/src/internal/cpu/cpu_x86.go: exit status 1
unsupported setting GO386=387. Consider using GO386=softfloat instead.

go tool dist: FAILED: /build/go/src/go/pkg/tool/linux_386/compile -std -pack -o /tmp/go-tool-dist-250139381/runtime/internal/sys/_go_.a -p runtime/internal/sys -importcfg /tmp/go-tool-dist-250139381/runtime/internal/sys/importcfg -asmhdr /tmp/go-tool-dist-250139381/runtime/internal/sys/go_asm.h -symabis /tmp/go-tool-dist-250139381/runtime/internal/sys/symabis /build/go/src/go/src/runtime/internal/sys/arch.go /build/go/src/go/src/runtime/internal/sys/arch_386.go /build/go/src/go/src/runtime/internal/sys/intrinsics_common.go /build/go/src/go/src/runtime/internal/sys/intrinsics_stubs.go /build/go/src/go/src/runtime/internal/sys/stubs.go /build/go/src/go/src/runtime/internal/sys/sys.go /build/go/src/go/src/runtime/internal/sys/zgoarch_386.go /build/go/src/go/src/runtime/internal/sys/zgoos_linux.go /build/go/src/go/src/runtime/internal/sys/zversion.go: exit status 1
=⇒ ERROR: A failure occurred in build().

  Aborting...

Upstream discussion about this bug: https://github.com/golang/go/issues/44500

Someone mentions a fix, but it doesn’t apply for non SSE2 devices.

Showing tasks 201 - 250 of 351 Page 5 of 8<<First - 3 - 4 - 5 - 6 - 7 - Last >>

Available keyboard shortcuts

Tasklist

Task Details

Task Editing