Bugs in Archlinux32 packages, specific to 32-bit issues.

Bugs  FS#2  to  FS#92  have been recovered and may be incomplete, the
recovered Google/Bing cache data can be found here.

IDCategoryTask TypePriority  descSeveritySummaryStatusProgress
284PackagesBug ReportMediumLow[qt] breaks on i686 and i486 (uses SSE2 optimisations)New
0%
Task Description

no task description

290PackagesBug ReportMediumLow[qt6-webengine] fails building with nodeNew
0%
Task Description
Traceback (most recent call last):
  File "/build/qt6-webengine/src/build/src/core/RelWithDebInfo/i686/../../../../../qtwebengine-everywhere-src-6.3.2/src/3rdparty/chromium/third_party/node/node.py", line 62, in <module>
    RunNode(sys.argv[1:])
  File "/build/qt6-webengine/src/build/src/core/RelWithDebInfo/i686/../../../../../qtwebengine-everywhere-src-6.3.2/src/3rdparty/chromium/third_party/node/node.py", line 57, in RunNode
    raise RuntimeError('Command \'%s\' failed\n%s' % (' '.join(cmd), err))
RuntimeError: Command '/usr/bin/node ../../../../../qtwebengine-everywhere-src-6.3.2/src/3rdparty/chromium/third_party/devtools-frontend/src/scripts/build/compress_files.js --file_list __third_party_devtools-frontend_src_compress__build_qt6-webengine_src_build_src_core_target_toolchain_target__rule..rsp' failed

This is presumably knitting together some documentation, node is currently broken on Arch32..

 306 PackagesBug ReportMediumLow [Xorg] fails on i686 Closed
100%
Task Description

For instance xauth cannot find libXext.so.6.

 307 PackagesBug ReportMediumLow [i486] make guile JIT failing Closed
100%
Task Description
*** work/functions/guile.base   Wed Nov 16 17:55:19 2022
--- work/functions/guile.log    Wed Nov 16 17:55:19 2022
***************
*** 1,3 ****
--- 1,7 ----
+ JIT failed to initialize
+ disabling automatic JIT compilation
+ JIT failed due to resource exhaustion
+ disabling automatic JIT compilation
310PackagesBug ReportMediumLow[webkit2gtk] needs a running RubyNew
0%
Task Description
<internal:/usr/lib/ruby/3.0.0/rubygems/core_ext/kernel_require.rb>:85:in `require': cannot load such file -- date_core (LoadError)
        from <internal:/usr/lib/ruby/3.0.0/rubygems/core_ext/kernel_require.rb>:85:in `require'
        from /usr/lib/ruby/3.0.0/date.rb:4:in `<top (required)>'
        from <internal:/usr/lib/ruby/3.0.0/rubygems/core_ext/kernel_require.rb>:85:in `require'
        from <internal:/usr/lib/ruby/3.0.0/rubygems/core_ext/kernel_require.rb>:85:in `require'
        from /build/webkit2gtk/src/webkitgtk-2.38.2/Source/JavaScriptCore/generator/GeneratedFile.rb:24:in `<top (required)>'
        from /build/webkit2gtk/src/webkitgtk-2.38.2/Source/JavaScriptCore/generator/DSL.rb:25:in `require_relative'
        from /build/webkit2gtk/src/webkitgtk-2.38.2/Source/JavaScriptCore/generator/DSL.rb:25:in `<top (required)>'
        from /build/webkit2gtk/src/webkitgtk-2.38.2/Source/JavaScriptCore/generator/main.rb:24:in `require_relative'
        from /build/webkit2gtk/src/webkitgtk-2.38.2/Source/JavaScriptCore/generator/main.rb:24:in `<main>'

And ruby is currently broken..

311PackagesBug ReportMediumLow[ffmpeg] fails with SIGILL on i686Assigned
0%
Task Description

work fine on pentium4

reproducable: ffplay <file.mp4>

offending opcode:

 0xb5f315e7:  f3 0f 10 83 d0 0b 00 00 movss  
                  0xbd0(%ebx),%xmm0
313PackagesBug ReportMediumLow[hg] broken on i486New
0%
Task Description
Traceback (most recent call last):
  File "/usr/bin/hg", line 59, in <module>
    dispatch.run()
  File "/usr/lib/python3.10/site-packages/mercurial/dispatch.py", line 143, in run
    status = dispatch(req)
  File "/usr/lib/python3.10/site-packages/mercurial/dispatch.py", line 232, in dispatch
    status = _rundispatch(req)
  File "/usr/lib/python3.10/site-packages/mercurial/dispatch.py", line 276, in _rundispatch
    ret = _runcatch(req) or 0
  File "/usr/lib/python3.10/site-packages/mercurial/dispatch.py", line 451, in _runcatch
    return _callcatch(ui, _runcatchfunc)
  File "/usr/lib/python3.10/site-packages/mercurial/dispatch.py", line 461, in _callcatch
    return scmutil.callcatch(ui, func)
  File "/usr/lib/python3.10/site-packages/mercurial/scmutil.py", line 153, in callcatch
    return func()
  File "/usr/lib/python3.10/site-packages/mercurial/dispatch.py", line 441, in _runcatchfunc
    return _dispatch(req)

That’s why ‘nss’ is not rebuilding on i486.

 316 PackagesBug ReportMediumLow [rust] exhausts virtual memory Closed
100%
Task Description
/usr/bin/ld: error: lib/libLLVMSupport.a(FileOutputBuffer.cpp.o)(.text._ZN12_GLOBAL__N_112OnDiskBufferD0Ev
) is too large (0x105 bytes)
/usr/bin/ld: failed to set dynamic section sizes: memory exhausted
collect2: error: ld returned 1 exit status

maybe we have to resort to cross-compiling rust in the end..

319PackagesBug ReportMediumLow[js102] rebuild results in a broken JS interpreter outp...New
0%
Task Description
 2:33.16 1 warning generated.
 2:47.25     Finished release [optimized] target(s) in 2m 24s
 3:50.23 js/src/build/libjs_static.a
 3:50.23 js/src/build/libmozjs-102.so
 3:51.27 js/src/gdb/gdb-tests
 3:51.27 js/src/shell/js
 3:51.33 js/src/jsapi-tests/jsapi-tests
 3:52.83 ./spidermonkey_checks.stub
 3:54.52 TEST-PASS | check_spidermonkey_style.py | ok
 3:54.79 TEST-PASS | check_macroassembler_style.py | ok
 3:54.84 TEST-PASS | check_js_opcode.py | ok
 3:55.04 7 compiler warnings present.
 3:55.09 Overall system resources - Wall time: 233s; CPU: 0%; Read bytes: 0; Write bytes: 0; Read time: 0; Write time: 0
 3:55.13 warning: intl/icu/source/i18n/nfsubs.cpp:1313:17 [-Wunused-but-set-variable] variable 'pow' set but not used
 3:55.13 warning: intl/icu/source/i18n/ucol.cpp:108:12 [-Wdeprecated-declarations] 'ucol_safeClone_71' is deprecated
 3:55.13 warning: mfbt/tests/TestResult.cpp:101:20 [-Wdeprecated-declarations] 'is_literal_type_v<mozilla::Result<int *, Failed>>' is deprecated
 3:55.13 warning: mfbt/tests/TestResult.cpp:102:20 [-Wdeprecated-declarations] 'is_literal_type_v<mozilla::Result<mozilla::Ok, Failed>>' is deprecated
 3:55.13 warning: mfbt/tests/TestResult.cpp:103:20 [-Wdeprecated-declarations] 'is_literal_type_v<mozilla::Result<mozilla::Ok, Foo8>>' is deprecated
 3:55.13 warning: mfbt/tests/TestResult.cpp:104:20 [-Wdeprecated-declarations] 'is_literal_type_v<mozilla::Result<Foo8, Foo16>>' is deprecated
 3:55.13 warning: mfbt/tests/TestResult.cpp:105:21 [-Wdeprecated-declarations] 'is_literal_type_v<mozilla::Result<mozilla::Ok, mozilla::UniquePtr<int>>>' is deprecated
 3:55.13 Your build was successful!
 Config object not found by mach.
Configure complete!
Be sure to run |mach build| to pick up any changes
To view resource usage of the build, run |mach resource-usage|.
To take your build for a test drive, run: |mach run|
Profiling instrumented JS...
/startdir/PKGBUILD: line 154:  6398 Segmentation fault      (core dumped) "$js" run.js
320PackagesBug ReportMediumLow[btop] On i486 fails on clock_gettime64New
0%
Task Description

shows a red ERROR: on startup, strace shows:

write(2, "\n", 1
)                       = 1
clock_gettime64(CLOCK_REALTIME, {tv_sec=1675495215, tv_nsec=436798535}) = 0
exit_group(1)                           = ?
+++ exited with 1 +++
[root@eurobuild6-7-i486 ~]# btop
ERROR: No UTF-8 locale detected!
321PackagesBug ReportMediumLow[gnome] brokenAssigned
0%
Task Description

mutter had a checksum issue (trivial).

gnome-shell misses a current version of gjs:

Dependency gjs-1.0 found: NO found 1.70.2 but need: '>= 1.73.1'
Did not find CMake 'cmake'
Found CMake: NO
Run-time dependency gjs-1.0 found: NO 

gnome-shell/meson.build:80:0: ERROR: Dependency lookup for gjs-1.0 with method 'pkgconfig' failed: Invalid version, need 'gjs-1.0' ['>= 1.73.1'] found '1.70.2'.

A full log can be found at /build/gnome-shell/src/build/meson-logs/meson-log.txt
 324 PackagesBug ReportMediumLow [libxft] segfaults Closed
100%
Task Description
Mar 08 19:16:01 arch32 audit[409]: ANOM_ABEND auid=1000 uid=0 gid=0 ses=5 pid=409 comm="slim" exe="/usr/bi                                                                                                          n/slim" sig=11 res=1                                                                                                                                                                                                
Mar 08 19:16:01 arch32 kernel: slim[409]: segfault at 30 ip b7dbe9e9 sp bf84f680 error 4 in libX11.so.6.4.                                                                                                          0[b7d9c000+8c000] likely on CPU 0 (core 0, socket 0)                                                                                                                                                                
Mar 08 19:16:01 arch32 kernel: Code: 04 00 00 83 c4 10 eb 8e 8d b4 26 00 00 00 00 66 90 53 e8 1a dd fd ff                                                                                                           81 c3 92 7a 11 00 83 ec 08 8b 44 24 10 8b 88 38 05 00 00 <8b> 51 30 83 fa ff 74 52 c7 41 30 ff ff ff ff 8b                                                                                                           88 d0 04 00 00 85                                                                                                                                                                  
Mar 08 19:16:01 arch32 systemd[1]: Started Process Core Dump (PID 424/UID 0).                                                                                                                                       
Mar 08 19:16:01 arch32 audit[1]: SERVICE_START pid=1 uid=0 auid=4294967295 ses=4294967295 msg='unit=system                                                                                                          d-coredump@1-424-0 comm="systemd" exe="/usr/lib/systemd/systemd" hostname=? addr=? terminal=? res=success'                                                                                                          
Mar 08 19:16:01 arch32 systemd-coredump[425]: [🡕] Process 409 (slim) of user 0 dumped core.                                                                                                                         
                                                                                                                                                                                                                    
                                              Stack trace of thread 409:                                                                                                                                            
                                              #0  0x00000000b7dbe9e9 _XAllocID (libX11.so.6 + 0x349e9)                                                                                                              
                                              #1  0x00000000b7d9f710 XCreatePixmap (libX11.so.6 + 0x15710)                                                                                                          
                                              #2  0x00000000b74cbd41 XRenderFindDisplay (libXrender.so.1 +                                                                                                           0x2d41)                                                                                                                                                                                                            
                                              #3  0x00000000b74cccf1 XRenderFreeGlyphSet (libXrender.so.1                                                                                                           + 0x3cf1)                                                                                                                                                                                                           
                                              #4  0x00000000b766e55b n/a (libXft.so.2 + 0x655b)                                                                                                                     
                                              #5  0x00000000b7c9a4fa _ZN5PanelD2Ev (libslim.so.1.3.6 + 0x1                                                                                                          34fa)                                                                                                                                                                                                               
                                              #6  0x00000000004bc49f _ZN3App13RestartServerEv (slim + 0xd4                                                                                                          9f)                                                                                                                                                                                                                 
                                              #7  0x00000000004bd623 _ZN3App5LoginEv (slim + 0xe623)                                                                                                                
                                              #8  0x00000000004bc073 _ZN3App3RunEv (slim + 0xd073)                                                                                                                  
                                              #9  0x00000000004b4742 main (slim + 0x5742)                                                                                                                           
                                              #10 0x00000000b7850129 n/a (libc.so.6 + 0x1f129)                                                                                                                      
                                              #11 0x00000000b78501fd __libc_start_main (libc.so.6 + 0x1f1f                                                                                                          d)                                                                                                                                                                                                                  
                                              #12 0x00000000004b48b5 _start (slim + 0x58b5)                                                                                                                         
                                              ELF object binary architecture: Intel 80386                                                                                                                           
326PackagesBug ReportMediumLow[php] needs a rebuildNew
0%
Task Description

httpd/conf/httpd.conf: Cannot load modules/libphp.so into server: libssl.so.1.1>

 331 PackagesBug ReportMediumLow [rust] rebootstrap Closed
100%
Task Description

seems like the virtual memory exhaustion is fixed in the newest version.
We have to bootstrap again (mainly for librsvg and firefox).

337PackagesBug ReportMediumLowpackages are being downgraded in reposNew
0%
Task Description

warning: filesystem: local (2023.09.18-1.0) is newer than core (2023.01.31-1.0)

348PackagesBug ReportMediumLowopenssl failing testsNew
0%
Task Description
30-test_aesgcm.t ........................ ok                                                                ������������������������������������������������������������������                                                                                             

ALG_PERR: engines/e_afalg.c(463): Failed to bind socket : No such file or directory                         �����������������������������������������������������������������������������������������������������������������������������                                                                                   
        # ERROR: (bool) 'EVP_CipherInit_ex(ctx, cipher, e, key, iv, 1) == true' failed @ test/afalgtest.c   ������������������������������������������������������������������������������������������������������������������������������������������������������������c                                                                             :85                                                                                                         �����           
        # false                                                                                             �����������������������                                                        
        # 00000000:error:40000067:lib(128)::socket bind failed:engines/e_afalg.c:464:                       ������������������������������������������������������������������������������������������������������������������������������:                                                                                  
        # OPENSSL_TEST_RAND_SEED=1707239178                                                                 �����������������������������������������������������������������                                                                                             
        not ok 1 - iteration 1                                                                              ������������������������������������������ㄠ                                                                                                
# ------------------------------------------------------------------------------                            ������������������������������������������������������������������������������������������������������������������������                                                                                    
ALG_PERR: engines/e_afalg.c(463): Failed to bind socket : No such file or directory                         �����������������������������������������������������������������������������������������������������������������������������                                                                                   
        # ERROR: (bool) 'EVP_CipherInit_ex(ctx, cipher, e, key, iv, 1) == true' failed @ test/afalgtest.c   ������������������������������������������������������������������������������������������������������������������������������������������������������������c                                                                             :85                                                                                                         �����           
        # false                                                                                             �����������������������                                                        
        # 00000000:error:40000067:lib(128)::socket bind failed:engines/e_afalg.c:464:                       ������������������������������������������������������������������������������������������������������������������������������:                                                                                  
        # OPENSSL_TEST_RAND_SEED=1707239178                                                                 �����������������������������������������������������������������                                                                                             
        not ok 2 - iteration 2                                                                              ������������������������������������������㈠                                                                                                
# ------------------------------------------------------------------------------                            ������������������������������������������������������������������������������������������������������������������������                                                                                    
ALG_PERR: engines/e_afalg.c(463): Failed to bind socket : No such file or directory                         �����������������������������������������������������������������������������������������������������������������������������                                                                                   
        # ERROR: (bool) 'EVP_CipherInit_ex(ctx, cipher, e, key, iv, 1) == true' failed @ test/afalgtest.c   ������������������������������������������������������������������������������������������������������������������������������������������������������������c                                                                             :85                                                                                                         �����           
        # false                                                                                             �����������������������                                                        
        # 00000000:error:40000067:lib(128)::socket bind failed:engines/e_afalg.c:464:                       ������������������������������������������������������������������������������������������������������������������������������:                                                                                  
        # OPENSSL_TEST_RAND_SEED=1707239178                                                                 �����������������������������������������������������������������                                                                                             
        not ok 3 - iteration 3                                                                              ������������������������������������������㌠                                                                                                
# ------------------------------------------------------------------------------                            ������������������������������������������������������������������������������������������������������������������������                                                                                    
    # OPENSSL_TEST_RAND_SEED=1707239178                                                                     �����������������������������������������������������������                                                                                              
    not ok 1 - test_afalg_aes_cbc                                                                           ������������������������������������������������c                                                                                               
# ------------------------------------------------------------------------------                            ������������������������������������������������������������������������������������������������������������������������                                                                                    
../../util/wrap.pl ../../test/afalgtest => 1                                                                ������������������������������������������������������������������                                                                                             
not ok 1 - running afalgtest                                                                                ������������������������������������������                                                                                                 

349PackagesBug ReportMediumLowtop print "get_mempolicy: Function not implemented" on ...New
0%
Task Description

no task description

 356 PackagesBug ReportMediumLow mkinitcpio core dump Closed
100%
Task Description
double free or corruption (out)
/usr/bin/mkinitcpio: line 557:  2387 Aborted                 (core dumped) MKINITCPIO_PROCESS_PRESET="$preset_name" "$0" "${preset_cmd[@]}"
error: command failed to execute correctly

Maybe also the age of the machine, the CMOS, the RAM, the moon, the universe could be
at fault here..

 358 PackagesBug ReportMediumLow All versions of samba > 4.17.5 are broken Closed
100%
Task Description

Either because of ICU or LDB incompatibilites.
tdb, ldb, samba and python have to be rebuild.

 190 Packages: StableBug ReportVery LowCritical mpv-1:0.33.1-2.0-pentium4 aborts immediately Closed
100%
Task Description

Here’s 1:0.33.1-1.0-pentium4:

$ pacman -Qs mpv
local/mpv 1:0.33.1-1.0
    a free, open source, and cross-platform media player

$ mpv --version
mpv 0.33.1-dirty Copyright © 2000-2020 mpv/MPlayer/mplayer2 projects
 built on UNKNOWN
FFmpeg library versions:
   libavutil       56.51.100
   libavcodec      58.91.100
   libavformat     58.45.100
   libswscale      5.7.100
   libavfilter     7.85.100
   libswresample   3.7.100
FFmpeg version: n4.3.2

Here’s 1:0.33.1-2.0-pentium4:

$ pacman -Qs mpv
local/mpv 1:0.33.1-2.0
    a free, open source, and cross-platform media player

$ mpv --msg-level=all=trace --version
libavutil: 56.70.100 -> 56.51.100
Aborted (core dumped)

Looks to me like it might be a library version thing (I’m up-to-date according to

pacman -Syu

), but I’ve only been running Arch32 for 24 hours so I’m not sure where further to dig.

 191 PackagesBug ReportVery LowCritical mpv links against libsrt.so.1 which does not exist Closed
100%
Task Description
$ pacman -Qs mpv
local/mpv 1:0.33.1-1.0
    a free, open source, and cross-platform media player
$ pacman -Qs srt
local/srt 1.4.3-1.0
    Secure Reliable Transport library
$ pacman -Fl srt | grep libsrt
srt usr/lib/libsrt.so
srt usr/lib/libsrt.so.1.4
srt usr/lib/libsrt.so.1.4.3
$ mpv
mpv: error while loading shared libraries: libsrt.so.1: cannot open shared object file: No such file or directory
$ ldd /usr/bin/mpv | grep srt
	libsrt.so.1 => not found
$ sudo ln -s /usr/lib/libsrt.so.1.4.3 /usr/lib/libsrt.so.1
$ mpv --version
mpv 0.33.1-dirty Copyright © 2000-2020 mpv/MPlayer/mplayer2 projects
 built on UNKNOWN
FFmpeg library versions:
   libavutil       56.51.100
   libavcodec      58.91.100
   libavformat     58.45.100
   libswscale      5.7.100
   libavfilter     7.85.100
   libswresample   3.7.100
FFmpeg version: n4.3.2

$ ldd /usr/bin/mpv | grep srt
	libsrt.so.1 => /usr/lib/libsrt.so.1 (0xb2a54000)

Running ldconfig does not create the missing symlink.

 198 PackagesBug ReportVery LowCritical [deleted due to spam] Closed
100%
Task Description

no task description

 221 Packages: TestingBug ReportVery LowCritical [exim] / is stuck in testing since a month Closed
100%
Task Description

Hi!

I just mentioned that exim stopped sending me emails… So I just upgraded to the package in community-testing… And now exim sends me emails, that complain about things like this:
“warning: exim: local (4.95-2.0) is newer than community (4.95-1.0)” LOL

Is there a reason, that the fresh package is being tested since a month now?

Thx.

Bye.

 224 PackagesBug ReportVery LowCritical gpg broken on pentium4 Closed
100%
Task Description

I had to rebuild sqlite to have dirmng start and still –recv-keys is not working, returning “general error”.

340PackagesBug ReportVery LowCritical[chromium] broken due to outdated libraries, plus also ...Unconfirmed
0%
Task Description

The package needs to be recompiled for re2 v10 and several required dependencies were not installed, such as icu69 (?) and more.

341PackagesBug ReportVery LowCriticalpython3 is version 11, but all packages install only 3....Unconfirmed
0%
Task Description

From a fresh install just now:

The /usr/lib/python3.10/site-packages folder is full of dozens of files, but there is little in the 3.11 folder. Some examples: gajim yt-dlp zippy samba.

This seems to affect most new packages that I install, so it is by no means limited to just the examples.

 95 Packages: StableBug ReportVery LowHigh KDE broken since KDE Frameworks 5.64 update Closed
100%
Task Description

KDE applications fail to start with the following error:

symbol lookup error: /usr/lib/libKF5QuickAddons.so.5: undefined symbol: _ZNK19KCoreConfigSkeleton10isDefaultsEv

The affected applications I’ve found so far are:
dolphin 19.08.3-1.0
kwin 5.17.3-1.0
plasma-workspace 5.17.0-2.0

After downgrading kdeclarative to 5.63.0-1.0 kwin and plasma start but dolphin fails with a new error:

dolphin: symbol lookup error: /usr/lib/libKF5KCMUtils.so.5: undefined symbol: _ZNK12KQuickAddons12ConfigModule11errorStringEv

Downgrading kcmutils to 5.63.0-1.0 finally fixed dolphin.

108Packages: StagingBug ReportVery LowHighlldb fails to run any binary (error: failed to launch o...Unconfirmed
0%
Task Description

Very easy to reproduce. lldb version 10.0.0, just try to run any binary.

[aeden@arch32 bin]$ lldb $(which date)
(lldb) target create “/usr/bin/date” Current executable set to ‘/usr/bin/date’ (i386).
(lldb) run
error: failed to launch or debug process
(lldb)

 111 PackagesBug ReportVery LowHigh [libxcrypt]: conflicts with glibc Closed
100%
Task Description
# pacman -Syu
....
error: failed to commit transaction (conflicting files)
libxcrypt: /usr/include/crypt.h exists in filesystem (owned by glibc)
libxcrypt: /usr/lib/libcrypt.so exists in filesystem (owned by glibc)
Errors occurred, no packages were upgraded.

this is a rather critical bug - it is required by gtk and qt, via libcups; so most desktop users are affected by it

 119 PackagesBug ReportVery LowHigh [gdb] needs rebuilt after python upgrade Closed
100%
Task Description

Pacman recently upgraded python from 3.8 to 3.9, which breaks the gdb package:

% gdb
gdb: error while loading shared libraries: libpython3.8.so.1.0: cannot open shared object file: No such file or directory
 121 PackagesBug ReportVery LowHigh Multiple packages need rebuild after libicu upgrade Closed
100%
Task Description

Over in  FS#119 , @abaumann mentioned that the libicu upgrade from 67 to 68 was part of what broke gdb. I missed the libicu upgrade when looking at gdb, but now that that one is resolved, I noticed a number of other packages that still link against the old and now nonexistant /usr/lib/libicu*.so.67 files. On my particular system, the following packages are installed, link to icu 67, and need rebuilt as well:

* harfbuzz-icu (2.7.0-1.0)
* mongo-c-driver (1.17.3-1.0)
* postfix (3.5.6-2.0)
* postgresql (12.4-1.0)
* postgresql-old-upgrade (12.5-1.0)
* samba (4.12.3-1.2)
* smbclient (4.12.3-1.2)
* syslog-ng (3.28.1-3.0)
* texlive-bin (2020.54586-4.0)
* xfsprogs (5.8.0-1.0)

… but I’m sure you have a way of determining all the affected packages?

As a workaround, in case others have the same problem, I manually extracted the old versioned .so files from the previous package to get things working again:

```
tar -C / -xf /var/cache/pacman/pkg/icu-67.1-1.0-i686.pkg.tar.zst –wildcards ‘usr/lib/lib*.so.*’ ```

- I’ll just have to remember to clean them up again later.

 192 PackagesBug ReportVery LowHigh [postgis] not satisfiable dependency: "libproj.so.22" Closed
100%
Task Description

The postgis package version 3.1.1-1.0 on pentium4 does not work because only
libproj-1.5.so is installed, and not the required libproj-2.2.so.

On upstream there seems to have been some rebuild of newer versions of gdal 3.2.2 and proj 8.0.0:
https://archlinux.org/todo/gdal-322-and-proj-800-rebuild/

 212 PackagesBug ReportVery LowHigh libblockdev issue with glibc Closed
100%
Task Description

Trying to start udisks2 daemon (systemctl start udisks2.service) fails because of a library issue.

/usr/lib/udisks2/udisksd: symbol lookup error: /usr/lib/libbd_utils.so.2: undefined symbol: g_spawn_check_wait_status

Maybe libblockdev needs to be recompiled with the right glibc version.

Thus, it is not possible to auto-mount external USB drives.

294PackagesBug ReportVery LowHigh[qtile] importlib.metadata.PackageNotFoundError: No pac...Assigned
0%
Task Description

When running qtile I get the following error message:

[qtile] importlib.metadata.PackageNotFoundError: No package metadata was found for qtile

Running qtile on Arch Linux works as expected.

$ qtile start
Traceback (most recent call last):
  File "/usr/bin/qtile", line 33, in <module>
    sys.exit(load_entry_point('qtile==0.18.1', 'console_scripts', 'qtile')())
  File "/usr/bin/qtile", line 22, in importlib_load_entry_point
    for entry_point in distribution(dist_name).entry_points
  File "/usr/lib/python3.10/importlib/metadata/__init__.py", line 957, in distribution
    return Distribution.from_name(distribution_name)
  File "/usr/lib/python3.10/importlib/metadata/__init__.py", line 548, in from_name
    raise PackageNotFoundError(name)
importlib.metadata.PackageNotFoundError: No package metadata was found for qtile
$ pacman -Qi qtile
Name            : qtile
Version         : 0.18.1-3.0
Description     : A full-featured, pure-Python tiling window manager
Architecture    : pentium4
URL             : http://www.qtile.org
Licenses        : MIT
Groups          : None
Provides        : None
Depends On      : gdk-pixbuf2  glibc  libnotify  librsvg  pango  python-cairocffi  python-cffi  python-xcffib  python-gobject  python-setuptools
Optional Deps   : alsa-utils: for volume widget
                  canto-daemon: for canto widget
                  cmus: for cmus widget
                  jupyter_console: for interaction with qtile via Jupyter
                  khal: for khal_calendar widget
                  libpulse: for pulse_volume and pulseaudio_ffi widget [installed]
                  lm_sensors: for sensors widget [installed]
                  moc: for moc widget
                  python-dbus-next: for utils, notifications and several widgets
                  python-iwlib: for wlan widget
                  python-keyring: for imapwidget widget
                  python-mpd2: mpd2widget widget
                  python-psutil: graph, net and memory widget [installed]
                  python-pywlroots: for experimental wayland support
                  python-setproctitle: change process name to qtile
                  python-xdg: launchbar widget
Required By     : None
Optional For    : None
Conflicts With  : None
Replaces        : None
Installed Size  : 3.25 MiB
Packager        : Andreas Baumann <mail@andreasbaumann.cc>
Build Date      : Mon 04 Oct 2021 12:02:58
Install Date    : Mon 26 Sep 2022 13:33:45
Install Reason  : Explicitly installed
Install Script  : Yes
Validated By    : Signature
$ sudo pacman -Syu
:: Synchronizing package databases...
 core downloading...
 extra downloading...
 community downloading...
:: Starting full system upgrade...
 there is nothing to do
325PackagesBug ReportVery LowHigh[terminus] crashes with message undefined symbol: cairo...Unconfirmed
0%
Task Description

Starting terminus gives following error:

from ._cairo import *  # noqa: F401,F403
ImportError: /usr/lib/python3.10/site-packages/cairo/_cairo.cpython-310-i386-linux-gnu.so: undefined symbol: cairo_tee_surface_index

Bug seens to be related to

https://bugs.archlinux.org/task/77367

There is generall mess on cairo related files for different architectures (pentium4, i486, i686) - some packages for one architecture are outdated, while for other archictectures are up to date, for instance:

  • python-cairo i486/extra : 1.21.0-1.0
  • python-cairo i686/extra : 1.23.0-3.0
  • python-cairo pentium4/extra : 1.23.0-3.0
 327 PackagesBug ReportVery LowHigh [firefox-106.0.3.1.1-pentium4] crashes in VMware virtua ...Closed
100%
Task Description

This is pentium4 related problem. Firefox crashes on startup with following messages:

ExceptionHandler::GenerateDump cloned child 814
ExceptionHandler::SendContinueSignalToChild sent continue signal to child
ExceptionHandler::WaitForContinueSignal waiting for continue signal...

Screenshot. Firefox folder after crash.

Temporary solution is to change in /etc/pacman/conf

Architecture=i686

, delete firefox for pentium4 from pacman cache and reinstall firefox

firefox-106.0.3.1.1-i686
 329 PackagesBug ReportVery LowHigh [go] Cannot install yay from AUR Closed
100%
Task Description

Installing yay from AUR

git clone https://aur.archlinux.org/yay.git
cd yay
makepkg -sri

gives following error

go: updates to go.sum needed, disabled by -mod=readonly

Reason - outdated version of go in i686 architecture

Temporary solution - use go for pentium4 (change temporarily architecture to pentium4 in /etc/pacman.conf)

333PackagesBug ReportVery LowHighSddm 0.19.0-9.0 crashes with Qt 5.15.9Assigned
0%
Task Description

The current version of sddm (0.19.0-9.0) depends on the previous version of Qt (5.15.8). After updating Qt, sddm crashes with an incompatible Qt library error.

 350 PackagesBug ReportVery LowHigh openssh service will not start Closed
100%
Task Description

After updating my system I found that sshd.service will no longer start.

As a temporary work round I downgraded openssl from 3.2.1-1.0 to 3.1.4-1.0

[keith@Arch32 ~]$ sudo pacman -Syu
:: Synchronising package databases...
 core-testing is up to date
 core is up to date
 extra-testing is up to date
 extra is up to date
:: Starting full system upgrade...
resolving dependencies...
looking for conflicting packages...

Package (1)           Old Version  New Version  Net Change

core-testing/openssl  3.1.4-1.0    3.2.1-1.0      1.03 MiB

Total Installed Size:  10.54 MiB
Net Upgrade Size:       1.03 MiB

:: Proceed with installation? [Y/n] 
(1/1) checking keys in keyring                                                                 [--------------------------------------------------------] 100%
(1/1) checking package integrity                                                               [--------------------------------------------------------] 100%
(1/1) loading package files                                                                    [--------------------------------------------------------] 100%
(1/1) checking for file conflicts                                                              [--------------------------------------------------------] 100%
(1/1) checking available disk space                                                            [--------------------------------------------------------] 100%
:: Processing package changes...
(1/1) upgrading openssl                                                                        [--------------------------------------------------------] 100%
:: Running post-transaction hooks...
(1/1) Arming ConditionNeedsUpdate...
[keith@Arch32 ~]$ systemctl restart sshd.service
[keith@Arch32 ~]$ systemctl status sshd.service
× sshd.service - OpenSSH Daemon
     Loaded: loaded (/usr/lib/systemd/system/sshd.service; enabled; preset: disabled)
     Active: failed (Result: exit-code) since Tue 2024-02-13 05:36:11 GMT; 6s ago
   Duration: 9ms
    Process: 1008 ExecStart=/usr/bin/sshd -D (code=exited, status=255/EXCEPTION)
   Main PID: 1008 (code=exited, status=255/EXCEPTION)
        CPU: 9ms

Feb 13 05:36:11 Arch32 systemd[1]: sshd.service: Scheduled restart job, restart counter is at 5.
Feb 13 05:36:11 Arch32 systemd[1]: Stopped OpenSSH Daemon.
Feb 13 05:36:11 Arch32 systemd[1]: sshd.service: Start request repeated too quickly.
Feb 13 05:36:11 Arch32 systemd[1]: sshd.service: Failed with result 'exit-code'.
Feb 13 05:36:11 Arch32 systemd[1]: Failed to start OpenSSH Daemon.
[keith@Arch32 ~]$ sudo downgrade openssl
loading packages...
warning: downgrading package openssl (3.2.1-1.0 => 3.1.4-1.0)
resolving dependencies...
looking for conflicting packages...

Package (1)  Old Version  New Version  Net Change

openssl      3.2.1-1.0    3.1.4-1.0     -1.03 MiB

Total Installed Size:   9.51 MiB
Net Upgrade Size:      -1.03 MiB

:: Proceed with installation? [Y/n] 
(1/1) checking keys in keyring                                                                 [--------------------------------------------------------] 100%
(1/1) checking package integrity                                                               [--------------------------------------------------------] 100%
(1/1) loading package files                                                                    [--------------------------------------------------------] 100%
(1/1) checking for file conflicts                                                              [--------------------------------------------------------] 100%
(1/1) checking available disk space                                                            [--------------------------------------------------------] 100%
:: Processing package changes...
(1/1) downgrading openssl                                                                      [--------------------------------------------------------] 100%
:: Running post-transaction hooks...
(1/1) Arming ConditionNeedsUpdate...
add openssl to IgnorePkg? [y/N] 
[keith@Arch32 ~]$ systemctl restart sshd.service
[keith@Arch32 ~]$ systemctl status sshd.service
● sshd.service - OpenSSH Daemon
     Loaded: loaded (/usr/lib/systemd/system/sshd.service; enabled; preset: disabled)
     Active: active (running) since Tue 2024-02-13 05:37:20 GMT; 5s ago
   Main PID: 1138 (sshd)
      Tasks: 1 (limit: 2293)
     Memory: 772.0K
        CPU: 61ms
     CGroup: /system.slice/sshd.service
             └─1138 "sshd: /usr/bin/sshd -D [listener] 0 of 10-100 startups"

Feb 13 05:37:20 Arch32 systemd[1]: Started OpenSSH Daemon.
Feb 13 05:37:20 Arch32 sshd[1138]: Server listening on 0.0.0.0 port 22.
Feb 13 05:37:20 Arch32 sshd[1138]: Server listening on :: port 22.
[keith@Arch32 ~]$ 

 93 Packages: StableBug ReportVery LowMedium pyparsing error is preventing applications from startin ...Closed
100%
Task Description

Came across this after completing a system update two days ago.

I run Radicale and that is refusing to start with the following error:

Traceback (most recent call last):
  File "/usr/bin/radicale", line 6, in <module>
    from pkg_resources import load_entry_point
  File "/usr/lib/python3.7/site-packages/pkg_resources/__init__.py", line 84, in <module>
    __import__('packaging.requirements')
  File "/usr/lib/python3.7/site-packages/packaging/requirements.py", line 9, in <module>
    from pyparsing import stringStart, stringEnd, originalTextFor, ParseException
ModuleNotFoundError: No module named 'pyparsing'

When attempting to run pip to see if that might correct the issue, I got the following error:

Traceback (most recent call last):
  File "/usr/bin/pip", line 6, in <module>
    from pkg_resources import load_entry_point
  File "/usr/lib/python3.7/site-packages/pkg_resources/__init__.py", line 84, in <module>
    __import__('packaging.requirements')
  File "/usr/lib/python3.7/site-packages/packaging/requirements.py", line 9, in <module>
    from pyparsing import stringStart, stringEnd, originalTextFor, ParseException
ModuleNotFoundError: No module named 'pyparsing'

It looks as though something recently broke pyparsing and that’s had a knockon effect for a few packages.

 114 Packages: StableBug ReportVery LowMedium Kmail: symbol lookup error Closed
100%
Task Description

Kmail 20.08.1-1.0 fails to start with symbol lookup error.

Steps to reproduce: invoking kmail on the console shows:

kmail: symbol lookup error: /usr/lib/libKF5MailImporter.so.5: undefined symbol: _ZN9PimCommon15CustomLogWidgetC1EP7QWidget

Downgrading messagelib fixes this issue but generates other issues (missing files or other undefined symbols).

After all I didn’t find a solution.

 118 PackagesBug ReportVery LowMedium signing key is expired Closed
100%
Task Description

When trying to install the package, packman complies about the the key to be of unknown trust. Cheking the keyring the associated key appers to be expired.

 167 Packages: StableBug ReportVery LowMedium Kernel lost crypto support necessary for iwd Closed
100%
Task Description

With linux 5.11.1.arch1-1.0, iwd no longer works for associating with WPA2 access points. On attempting to start the service, the journal reads:

iwd: RC4 support not found
iwd: The following options are missing in the kernel:
iwd:    CONFIG_CRYPTO_USER_API_SKCIPHER
iwd:    CONFIG_CRYPTO_ECB
iwd:    CONFIG_CRYPTO_ARC4

It would be nice to have these options enabled in the kernel config, so as to continue support for the iwd package.

172PackagesBug ReportVery LowMediumiwd requires some kernel flagsUnconfirmed
0%
Task Description

RC4 support not found
The following options are missing in the kernel:

CONFIG_CRYPTO_USER_API_SKCIPHER
CONFIG_CRYPTO_ECB
CONFIG_CRYPTO_ARC4
 173 PackagesBug ReportVery LowMedium supertux is broken (depends on libboostfilesystem 0.72  ...Closed
100%
Task Description

Supertux needs to be rebuilt as it currently depends on the wrong version of libboostfilesystem.

https://www.archlinux32.org/packages/i686/community/supertux/ not satisfiable dependency: “libboost_filesystem.so.1.72.0” (link)
not satisfiable dependency: “libboost_locale.so.1.72.0” (link)

This affects all architectures (i686 and pentium4)

 179 Packages: StableBug ReportVery LowMedium Snapper needs rebuild from icu upgrade Closed
100%
Task Description

icu69.1-1.0 however snapper still links against libicuuc.so.68

Running snapper now gives the following error:

# snapper list /
snapper: error while loading shared libraries: libicuuc.so.68: cannot open shared object file: No such file or directory
210PackagesBug ReportVery LowMediumkeymap don't gets fixed on login as set in /etc/vconsol...Unconfirmed
0%
Task Description

gzip comes with asm code, if enabled, built a TEXTREL which gets bloqued on boot, so systemd don’t set keymap
A lot of tricks in forums, old thread more complete here $506 An old problem. Work around while asm gets fixed is call configure with DEFS=”NO_ASM” like this:

...
export DEFS="NO_ASM"
./configure ....

or,

./configure DEFS="NO_ASM" ....

I have not tested it, but gentoo on x32 have gzip like this and no TEXTRELS here.
No matter i486, i686 or pentium.

Hope it helps.

Best regards.

 211 PackagesBug ReportVery LowMedium asp32 Closed
100%
Task Description

asp32 fails to export/checkout anything.

Esample:

# asp32 export pacman
fatal: unable to update url base from redirection:

asked for: https://git.archlinux.org/svntogit/packages.git/info/refs?service=git-upload-pack
 redirect: https://gitlab.archlinux.org/explore/groups

error: failed to update remote packages64

243PackagesBug ReportVery LowMedium[linux and linux-zen] 5.16.12 needs a rebuild with gcc...New
0%
Task Description

[linux and linux-zen] 5.16.12 needs a rebuild with gcc 11.2 so DKMS packages will work

get errors when dkms installing in make log

cc1: error: incompatible gcc/plugin versions
cc1: error: failed to initialize plugin ./scripts/gcc-plugins/structleak_plugin.so

 273 Packages: StableBug ReportVery LowMedium Quazip Qt5 package contains Qt6 libraries Closed
100%
Task Description

The quazip-qt5 package for both i686 and pentium4 contains the Qt6 libraries instead of the Qt5 ones.

The quazip package also no longer seems to exist upstream and should probably be removed in Arch32 as well.

Showing tasks 201 - 250 of 350 Page 5 of 7<<First - 3 - 4 - 5 - 6 - 7 -

Available keyboard shortcuts

Tasklist

Task Details

Task Editing