Bugs in Archlinux32 packages, specific to 32-bit issues.

Bugs  FS#2  to  FS#92  have been recovered and may be incomplete, the
recovered Google/Bing cache data can be found here.

IDCategoryTask Type  ascPrioritySeveritySummaryStatusProgress
 113 PackagesBug ReportVery LowLow [leafpad]: segfaults Closed
100%
Task Description

start leafpad
everything looks fine
type or paste anything and it segfaults with this error in dmesg

leafpad[550]: segfault at 1 ip b77adf13 sp bfd0eaec error 4 in libgobject-2.0.so.0.6400.3[b7787000+2f000]
 114 Packages: StableBug ReportVery LowMedium Kmail: symbol lookup error Closed
100%
Task Description

Kmail 20.08.1-1.0 fails to start with symbol lookup error.

Steps to reproduce: invoking kmail on the console shows:

kmail: symbol lookup error: /usr/lib/libKF5MailImporter.so.5: undefined symbol: _ZN9PimCommon15CustomLogWidgetC1EP7QWidget

Downgrading messagelib fixes this issue but generates other issues (missing files or other undefined symbols).

After all I didn’t find a solution.

 115 PackagesBug ReportMediumLow gnome doesn't start Closed
100%
Task Description

gnome-shell segfaults in libmutter.

                                                               Stack trace of thread 1009:
                                                               #0  0x00000000b64d5436 n/a (libmutter-cogl-6.so.0 + 0xe436)
                                                               #1  0x00000000b64d809c n/a (libmutter-cogl-6.so.0 + 0x1109c)
                                                               #2  0x00000000b653edb9 n/a (libmutter-cogl-6.so.0 + 0x77db9)
                                                               #3  0x00000000b64f8fc5 cogl_flush (libmutter-cogl-6.so.0 + 0x31fc5)
                                                               #4  0x00000000b6549154 cogl_onscreen_swap_buffers_with_damage (libmutter-cogl-6.so.0 + 0x82154)
                                                               #5  0x00000000b6c59f73 n/a (libmutter-clutter-6.so.0 + 0x10ff73)
                                                               #6  0x00000000b6c53cf2 n/a (libmutter-clutter-6.so.0 + 0x109cf2)
                                                               #7  0x00000000b6c54747 n/a (libmutter-clutter-6.so.0 + 0x10a747)
                                                               #8  0x00000000b6bf52ad n/a (libmutter-clutter-6.so.0 + 0xab2ad)
                                                               #9  0x00000000b7703bde g_main_context_dispatch (libglib-2.0.so.0 + 0x4dbde)
                                                               #10 0x00000000b7752962 n/a (libglib-2.0.so.0 + 0x9c962)
                                                               #11 0x00000000b7702299 g_main_loop_run (libglib-2.0.so.0 + 0x4c299)
                                                               #12 0x00000000b697f216 meta_run (libmutter-6.so.0 + 0xb9216)
                                                               #13 0x000000000043144e n/a (gnome-shell + 0x244e)
                                                               #14 0x00000000b7cd900e __libc_start_main (libc.so.6 + 0x1f00e)
                                                               #15 0x0000000000431635 n/a (gnome-shell + 0x2635)
 118 PackagesBug ReportVery LowMedium signing key is expired Closed
100%
Task Description

When trying to install the package, packman complies about the the key to be of unknown trust. Cheking the keyring the associated key appers to be expired.

 119 PackagesBug ReportVery LowHigh [gdb] needs rebuilt after python upgrade Closed
100%
Task Description

Pacman recently upgraded python from 3.8 to 3.9, which breaks the gdb package:

% gdb
gdb: error while loading shared libraries: libpython3.8.so.1.0: cannot open shared object file: No such file or directory
 120 PackagesBug ReportVery LowLow Princeton ArchLinux32 mirror has been out of date; ques ...Closed
100%
Task Description

The ArchLinux32 mirror at http[s]://mirror.math.princeton.edu/pub/archlinux32/ appears to have stopped syncing properly in October. I contacted web@math.princeton.edu on January 1 to alert them to the problem, and received the following response from a Princeton sysadmin:


Here is the configuration I am using:
archlinux32:
   remotesrc: “rsync://mirror.archlinux32.org/archlinux32/”
   localdest: “/var/www/html/pub/archlinux32”
   extraopts: “–port=22873”
Looks like at some point this stopped working from upstream:
Raw standard error:
rsync: failed to connect to mirror.archlinux32.org (85.10.198.216): Connection refused (111)
rsync: failed to connect to mirror.archlinux32.org (2a01:4f8:a0:5264::2): Network is unreachable (101)
rsync error: error in socket IO (code 10) at clientserver.c(125) [Receiver=3.1.2]
Can you recommend a better upstream target I can use? And if there are additional constraints on checkin time or frequency.

I informed him that I am not an official member of the ArchLinux32 team, but suggested that using the regular rsync port of 873 might work as mirror.archlinux32.org appears to accept connections to that port from the Internet. As of the time of this writing, it appears that the mirror is now again up to date (although it has other issues returning HTTP error 403 for some of its files), but I promised to bring his additional questions to the official team.

So, to iterate, is this the appropriate target to mirror, or should they use some other parameters?

Thank you.

 121 PackagesBug ReportVery LowHigh Multiple packages need rebuild after libicu upgrade Closed
100%
Task Description

Over in  FS#119 , @abaumann mentioned that the libicu upgrade from 67 to 68 was part of what broke gdb. I missed the libicu upgrade when looking at gdb, but now that that one is resolved, I noticed a number of other packages that still link against the old and now nonexistant /usr/lib/libicu*.so.67 files. On my particular system, the following packages are installed, link to icu 67, and need rebuilt as well:

* harfbuzz-icu (2.7.0-1.0)
* mongo-c-driver (1.17.3-1.0)
* postfix (3.5.6-2.0)
* postgresql (12.4-1.0)
* postgresql-old-upgrade (12.5-1.0)
* samba (4.12.3-1.2)
* smbclient (4.12.3-1.2)
* syslog-ng (3.28.1-3.0)
* texlive-bin (2020.54586-4.0)
* xfsprogs (5.8.0-1.0)

… but I’m sure you have a way of determining all the affected packages?

As a workaround, in case others have the same problem, I manually extracted the old versioned .so files from the previous package to get things working again:

```
tar -C / -xf /var/cache/pacman/pkg/icu-67.1-1.0-i686.pkg.tar.zst –wildcards ‘usr/lib/lib*.so.*’ ```

- I’ll just have to remember to clean them up again later.

 122 PackagesBug ReportVery LowLow Permissions bits on files on the primary mirror are too ...Closed
100%
Task Description

In my quest to find a working mirror close to me, I’ve come across another issue with at least a couple of mirrors. Some mirrors respond with a HTTP 403 Forbidden for certain files, notably many of the Pacman database files. At the time of this writing, I’m aware of this problem happening with the princeton.edu and the clarkson.edu mirrors. I’ve been in contact with the admin of one of the mirrors, and they’ve pointed out that the permission bits are set to 0600 at the source. If the primary mirror could have their files be world readable, it would likely fix this problem automatically across more than one mirror.

Is that something we can do?

Steps to verify:

1. Access certain files from the primary mirror using rsync, for example:

% rsync -av rsync://mirror.archlinux32.org/archlinux32/i686/extra/extra.db.tar.gz .
receiving incremental file list
extra.db.tar.gz

sent 43 bytes  received 2,044,453 bytes  371,726.55 bytes/sec
total size is 2,043,851  speedup is 1.00

2. Examine permission bits:

% ls -l extra.db.tar.gz
-rw------- 1 user user 2043851 Jan  8 11:51 extra.db.tar.gz

Should be -rw-r–r–.

 123 PackagesBug ReportMediumLow libhandy0, libhandy conflicts Closed
100%
Task Description

libhandy0: /usr/share/vala/vapi/libhandy-0.0.deps exists in filesystem (owned by libhandy)
libhandy0: /usr/share/vala/vapi/libhandy-0.0.vapi exists in filesystem (owned by libhandy)

 124 PackagesBug ReportMediumLow mutter and gnome-shell are in confllict Closed
100%
Task Description

:: installing mutter (3.38.1-1.1) breaks dependency ‘libmutter-6.so=0-32’ required by gnome-shell

 125 PackagesBug ReportMediumLow seamonkey broken on i686 Closed
100%
Task Description

breaks in more SIMD optimizations.

 127 PackagesBug ReportMediumLow iotop doesn't work Closed
100%
Task Description
root@arch32-stable-pentium4 ~]# iotop
No module named 'iotop'
To run an uninstalled copy of iotop,
launch iotop.py in the top directory

iotop is a Python script, presumably some Python modules are missing.

 128 PackagesBug ReportMediumLow newsboat needs rebuild against newer libjson-c Closed
100%
Task Description
newsboat: error while loading shared libraries: libjson-c.so.4: cannot open shared object file: No such file or directory
 129 PackagesBug ReportMediumLow rust 1.47 is outdated Closed
100%
Task Description

either building 1.49 via 1.48, via 1.47 or we have to bootstrap from a binary version again.

 130 PackagesBug ReportMediumLow user-manager and plasma-meta are in conflict Closed
100%
Task Description

:: removing user-manager breaks dependency ‘user-manager’ required by plasma-meta

 131 PackagesBug ReportMediumLow libseccomp doesn't build in python bindings Closed
100%
Task Description

no task description

 133 PackagesBug ReportMediumLow libao and libpulse mixup Closed
100%
Task Description
resolving dependencies...
warning: cannot resolve "libpulse.so=0-32", a dependency of "libao"
warning: cannot resolve "libpulse-simple.so=0-32", a dependency of "libao"
:: The following package cannot be upgraded due to unresolvable dependencies:
      libao

:: Do you want to skip the above package for this upgrade? [y/N] n
error: failed to prepare transaction (could not satisfy dependencies)
:: unable to satisfy dependency 'libpulse.so=0-32' required by libao
:: unable to satisfy dependency 'libpulse-simple.so=0-32' required by libao
 134 PackagesBug ReportVery LowLow arm-none-eabi-gdb requires rebuild Closed
100%
Task Description

arm-none-eabi-gdb is broken due to not satisfiable dependency: “libpython3.8.so.1.0” After recompiling from upstream it works.

 135 PackagesBug ReportMediumLow namcap fails on libxkbcommon Closed
100%
Task Description
Checking PKGBUILD
Traceback (most recent call last):
  File "/usr/lib/python3.9/runpy.py", line 197, in _run_module_as_main
    return _run_code(code, main_globals, None,
  File "/usr/lib/python3.9/runpy.py", line 87, in _run_code
    exec(code, run_globals)
  File "/usr/lib/python3.9/site-packages/namcap.py", line 247, in <module>
    process_pkgbuild(package, active_modules)
  File "/usr/lib/python3.9/site-packages/namcap.py", line 153, in process_pkgbuild
    name = "PKGBUILD (" + pkginfo["name"] + ")"
  File "/usr/lib/python3.9/site-packages/Namcap/package.py", line 128, in __getitem__
    return self._data[self.canonical_varname(key)]
KeyError: 'name'
==> Running checkpkg
error: no targets specified (use -h for help)
==> WARNING: Skipped checkpkg due to missing repo packages
 136 PackagesBug ReportMediumLow Haskell probably completely fails to rebuild Closed
100%
Task Description
Configuring attoparsec-0.13.2.4...
Error:
    The following packages are broken because other packages they depend on are missing. These broken packages must be rebuilt before they can be used.
installed package tasty-1.3.1 is broken due to missing package ansi-terminal-0.11-2SXi8ZhU18i2uWLidRUotS, async-2.2.2-K8T9LglWxlG5HgD5vvGjbo, optparse-applicative-0.16.1.0-JDPEASK1GJS1Nsq2qjjZCq
installed package tasty-quickcheck-0.10.1.2 is broken due to missing package QuickCheck-2.14.2-io0WylueSG4seqSTUQCKM, optparse-applicative-0.16
 137 PackagesBug ReportMediumLow llvm rebuild fails (aka sphinx requires a python module ...Closed
100%
Task Description
Configuration error:
There is a programmable error in your configuration file:

Traceback (most recent call last):
  File "/usr/lib/python3.9/site-packages/sphinx/config.py", line 326, in eval_config_file
    execfile_(filename, namespace)
  File "/usr/lib/python3.9/site-packages/sphinx/util/pycompat.py", line 88, in execfile_
    exec(code, _globals)
  File "/build/llvm/src/llvm-11.0.1.src/docs/conf.py", line 40, in <module>
    import recommonmark
ModuleNotFoundError: No module named 'recommonmark'
 138 PackagesBug ReportMediumLow polkit doesn't build because of a stuck js78 Closed
100%
Task Description

no task description

 139 PackagesBug ReportMediumLow webkit2gtk doesn't build Closed
100%
Task Description

This blocks tons of packages..

 140 PackagesBug ReportMediumLow libproxy doesn't build Closed
100%
Task Description
-- Installing: /build/libproxy/pkg/libproxy/usr/include/proxy.h
-- Installing: /build/libproxy/pkg/libproxy/usr/bin/proxy
mv: cannot stat '/build/libproxy/pkg/libproxy/usr/lib/libproxy/*/modules/pacrunner_webkit.so': No such file or directory
==> ERROR: A failure occurred in package_libproxy().
    Aborting...
 142 PackagesBug ReportMediumLow gnome-terminal doesn't start Closed
100%
Task Description
# Error constructing proxy for org.gnome.Terminal:/org/gnome/Terminal/Factory0: Could not connect: Connection refused

As this is the case since months, I cannot imagine somebody is still using Gnome on Archlinux32..

 144 PackagesBug ReportMediumLow firefox fails to build Closed
100%
Task Description
/build/seamonkey/src/seamonkey-2.53.5/obj-i686-pc-linux-gnu/_virtualenv/bin/python /build/seamonkey/src/s                                                                                                           eamonkey-2.53.5/mozilla/toolkit/mozapps/installer/packager.py -DMOZ_APP_NAME=seamonkey -DPREF_DIR=default                                                                                                           s/pref -DJAREXT= -DMOZ_CALENDAR=1 -DMOZ_GTK=1 -DMOZ_IRC=1 -DMOZ_DOMINSPECTOR=1 -DMOZ_SYSTEM_NSPR=1 -DMOZ_                                                                                                           SYSTEM_NSS=1 -DMOZ_MOVEMAIL=1 -DNECKO_WIFI=1 -DMOZ_BUNDLED_FONTS=1 -DMOZ_CHILD_PROCESS_NAME=plugin-contai                                                                                                           ner -DDLL_PREFIX=lib -DDLL_SUFFIX=.so -DBIN_SUFFIX= -DDIR_MACOS= -DDIR_RESOURCES= -DBINPATH=bin -DRESPATH                                                                                                           =bin -DLPROJ_ROOT=en -DCLANG_CXX -DA11Y_LOG=1 -DACCESSIBILITY=1 -DATK_MAJOR_VERSION=2 -DATK_MINOR_VERSION                                                                                                           =36 -DATK_REV_VERSION=0 -DBUILD_CTYPES=1 -DCROSS_COMPILE='' -DD_INO=d_ino -DENABLE_INTL_API=1 -DENABLE_SY                                                                                                           STEM_EXTENSION_DIRS=1 -DEXPOSE_INTL_API=1 -DFIREFOX_VERSION=60.7.5 -DFORCE_PR_LOG=1 -DFUNCPROTO=15 -DGDK_                                                                                                           VERSION_MAX_ALLOWED=GDK_VERSION_3_4 -DGLIB_VERSION_MAX_ALLOWED=GLIB_VERSION_2_32 -DGLIB_VERSION_MIN_REQUIRED=GLIB_VERSION_2_26 -DGL_PROVIDER_GLX=1 -DHAVE_ALLOCA_H=1 -DHAVE_BYTESWAP_H=1 -DHAVE_CLOCK_MONOTONIC=1 -DHAVE_CPUID_H=1 -DHAVE_DIRENT_H=1 -DHAVE_DLADDR=1 -DHAVE_DLOPEN=1 -DHAVE_FONTCONFIG_FCFREETYPE_H=1 -DHAVE_FT_BITMAP_SIZE_Y_PPEM=1 -DHAVE_FT_GLYPHSLOT_EMBOLDEN=1 -DHAVE_FT_LOAD_SFNT_TABLE=1 -DHAVE_GETOPT_H=1 -DHAVE_GETTID=1 -DHAVE_GMTIME_R=1 -DHAVE_I18N_LC_MESSAGES=1 -DHAVE_INTTYPES_H=1 -DHAVE_LCHOWN=1 -DHAVE_LINUX_IF_ADDR_H=1 -DHAVE_LINUX_PERF_EVENT_H=1 -DHAVE_LINUX_QUOTA_H=1 -DHAVE_LINUX_RTNETLINK_H=1 -DHAVE_LOCALECONV=1 -DHAVE_LOCALTIME_R=1 -DHAVE_LSTAT64=1 -DHAVE_MALLINFO=1 -DHAVE_MALLOC_H=1 -DHAVE_MALLOC_USABLE_SIZE=1 -DHAVE_MEMALIGN=1 -DHAVE_MEMMEM=1 -DHAVE_MOVEMAIL=1 -DHAVE_NETINET_IN_H=1 -DHAVE_NL_TYPES_H=1 -DHAVE_POSIX_FADVISE=1 -DHAVE_POSIX_FALLOCATE=1 -DHAVE_POSIX_MEMALIGN=1 -DHAVE_PTHREAD_H=1 -DHAVE_RES_NINIT=1 -DHAVE_SETPRIORITY=1 -DHAVE_STAT64=1 -DHAVE_STDINT_H=1 -DHAVE_STRERROR=1 -DHAVE_STRNDUP=1 -DHAVE_SYSCALL=1 -DHAVE_SYS_QUEUE_H=1 -DHAVE_SYS_QUOTA_H=1 -DHAVE_SYS_TYPES_H=1 -DHAVE_THREAD_TLS_KEYWORD=1 -DHAVE_TRUNCATE64=1 -DHAVE_UNISTD_H=1 -DHAVE_VALLOC=1 -DHAVE_VA_COPY=1 -DHAVE_VISIBILITY_ATTRIBUTE=1 -DHAVE_VISIBILITY_HIDDEN_ATTRIBUTE=1 -DHAVE__UNWIND_BACKTRACE=1 -DHAVE___CXA_DEMANGLE=1 -DJS_DEFAULT_JITREPORT_GRANULARITY=3 -DMALLOC_H='<malloc.h>' -DMALLOC_USABLE_SIZE_CONST_PTR='' -DMOZILLA_OFFICIAL=1 -DMOZILLA_UAVERSION='"60.0"' -DMOZILLA_VERSION='"60.7.5"' -DMOZILLA_VERSION_U=60.7.5 -DMOZ_ACCESSIBILITY_ATK=1 -DMOZ_ALLOW_LEGACY_EXTENSIONS=1 -DMOZ_APP_UA_NAME='""' -DMOZ_APP_UA_VERSION='"2.53.5"' -DMOZ_AV1=1 -DMOZ_BUILD_APP=../suite -DMOZ_BUNDLED_FONTS=1 -DMOZ_CONTENT_SANDBOX=1 -DMOZ_DAV1D_ASM=1 -DMOZ_DISABLE_STARTUPCACHE=1 -DMOZ_DISTRIBUTION_ID='"org.mozilla"' -DMOZ_DLL_SUFFIX='".so"' -DMOZ_ENABLE_DBUS=1 -DMOZ_ENABLE_MASK_AS_SHORTHAND=1 -DMOZ_ENABLE_SKIA=1 -DMOZ_ENABLE_STARTUP_NOTIFICATION=1 -DMOZ_ENABLE_XREMOTE=1 -DMOZ_FEEDS=1 -DMOZ_FFMPEG=1 -DMOZ_FFVPX=1 -DMOZ_FFVPX_FLACONLY=1 -DMOZ_FMP4=1 -DMOZ_GECKO_PROFILER=1 -DMOZ_GLUE_IN_PROGRAM=1 -DMOZ_GMP_SANDBOX=1 -DMOZ_INSTRUMENT_EVENT_LOOP=1 -DMOZ_LOGGING=1 -DMOZ_MACBUNDLE_ID=org.mozilla.seamonkey -DMOZ_MEMORY=1 -DMOZ_MORK=1 -DMOZ_PEERCONNECTION=1 -DMOZ_PERMISSIONS=1 -DMOZ_PLACES=1 -DMOZ_PULSEAUDIO=1 -DMOZ_RAW=1 -DMOZ_RUST_SIMD=1 -DMOZ_SAMPLE_TYPE_FLOAT32=1 -DMOZ_SANDBOX=1 -DMOZ_SCTP=1 -DMOZ_SEPARATE_MANIFEST_FOR_THEME_OVERRIDES=1 -DMOZ_SRTP=1 -DMOZ_STATIC_JS=1 -DMOZ_SUITE=1 -DMOZ_SYSTEM_ICU=1 -DMOZ_TREE_CAIRO=1 -DMOZ_UPDATE_CHANNEL=default -DMOZ_USER_DIR='".mozilla"' -DMOZ_VORBIS=1 -DMOZ_VPX_NO_MEM_REPORTING=1 -DMOZ_WEBM_ENCODER=1 -DMOZ_WEBRTC=1 -DMOZ_WEBRTC_ASSERT_ALWAYS=1 -DMOZ_WEBRTC_SIGNALING=1 -DMOZ_WEBSPEECH=1 -DMOZ_WEBSPEECH_TEST_BACKEND=1 -DMOZ_WIDGET_GTK=3 -DMOZ_X11=1 -DMOZ_XUL=1 -DNO_NSPR_10_SUPPORT=1 -DNS_PRINTING=1 -DNS_PRINT_PREVIEW=1 -DRELEASE_OR_BETA=1 -DSTATIC_JS_API=1 -DSTDC_HEADERS=1 -DTARGET_XPCOM_ABI='"x86-gcc3"' -DUSE_SKIA=1 -DUSE_SKIA_GPU=1 -DU_USING_ICU_NAMESPACE=0 -DVA_COPY=va_copy -DVPX_X86_ASM=1 -DXP_LINUX=1 -DXP_UNIX=1 -D_REENTRANT=1 -DAB_CD=en-US \
        --format omni \
        --removals /build/seamonkey/src/seamonkey-2.53.5/suite/installer/removed-files.in \
         \
         \
         \
         \
        --optimizejars \
        --disable-compression \
        package-manifest ../../dist ../../dist/seamonkey \
        --non-resource defaults/messenger/mailViews.dat defaults/profile/panels.rdf defaults/profile/mimeTypes.rdf defaults/profile/chrome/userChrome-example.css defaults/profile/chrome/userContent-example.css 
terminate called after throwing an instance of 'std::runtime_error'
  what():  Section index out of bounds
Traceback (most recent call last):
  File "/build/seamonkey/src/seamonkey-2.53.5/mozilla/toolkit/mozapps/installer/packager.py", line 326, in <module>
    main()
  File "/build/seamonkey/src/seamonkey-2.53.5/mozilla/toolkit/mozapps/installer/packager.py", line 320, in main
    copier.copy(args.destination)
  File "/build/seamonkey/src/seamonkey-2.53.5/mozilla/python/mozbuild/mozpack/copier.py", line 428, in copy
    copy_results.append((destfile, f.copy(destfile, skip_if_older)))
  File "/build/seamonkey/src/seamonkey-2.53.5/mozilla/python/mozbuild/mozpack/files.py", line 296, in copy
    elfhack(dest)
  File "/build/seamonkey/src/seamonkey-2.53.5/mozilla/python/mozbuild/mozpack/executables.py", line 124, in elfhack
    errors.fatal('Error executing ' + ' '.join(cmd))
  File "/build/seamonkey/src/seamonkey-2.53.5/mozilla/python/mozbuild/mozpack/errors.py", line 103, in fatal
    self._handle(self.FATAL, msg)
  File "/build/seamonkey/src/seamonkey-2.53.5/mozilla/python/mozbuild/mozpack/errors.py", line 98, in _handle
    raise ErrorMessage(msg)
mozpack.errors.ErrorMessage: Error: Error executing /build/seamonkey/src/seamonkey-2.53.5/obj-i686-pc-linux-gnu/build/unix/elfhack/elfhack ../../dist/seamonkey/libxul.so
make[2]: *** [/build/seamonkey/src/seamonkey-2.53.5/mozilla/toolkit/mozapps/installer/packager.mk:22: stage-package] Error 1
make[2]: Leaving directory '/build/seamonkey/src/seamonkey-2.53.5/obj-i686-pc-linux-gnu/suite/installer'
make[1]: *** [/build/seamonkey/src/seamonkey-2.53.5/mozilla/../suite/build.mk:13: install] Error 2
make[1]: Leaving directory '/build/seamonkey/src/seamonkey-2.53.5/obj-i686-pc-linux-gnu'
make: *** [client.mk:404: install] Error 2
==> ERROR: A failure occurred in package().
    Aborting...
==> ERROR: Build failed, check /var/lib/archbuild/slave1/staging-pentium4/slave1/build
used straw: :mirrored_source:mirrored_source_by_hash:

 145 PackagesBug ReportMediumLow glibc 2.33 breaks i686 and i486 architectures Closed
100%
Task Description
/usr/lib/libc.6: CPU ISA level is lower than required.

updating effectively breaks all commands!

For those lucky enough to have a pacman-static installed, they can
IMMEDIATEDY downgrade glibc and keep the machine alive.

This is considered a distribution-killing bug for i486 and i686.

Pentium4 is not affectted.

 146 Packages: UpstreamBug ReportMediumLow trojita doesn't build, missing a patch, failures on qt  ...Closed
100%
Task Description

=⇒ ERROR: Failure while downloading https://cgit.kde.org/trojita.git/patch/?id=cf2364b8

SHA1 in https://anongit.kde.org/trojita):

cf2364b80fa8ae844df8350cd5833d47cce235f2

    Fix possible crash when downloading attachments

Yep, promising, lets download the patch and add it to the package.

Original bug: https://bugs.kde.org/show_bug.cgi?id=417697

/build/trojita/src/trojita-0.7/src/Gui/Window.cpp:981:26: error: aggregate ‘QPainterPath path’ has incomplete type and cannot be defined
  981 |             QPainterPath path;
      |                          ^~~~

needs a #include <QPainterPath>

Reported as https://bugs.kde.org/show_bug.cgi?id=432827

 147 PackagesBug ReportMediumLow kpgp fails at startup Closed
100%
Task Description
Feb 12 11:57:48 arch32-testing-pentium4 audit[9829]: USER_LOGIN pid=9829 uid=0 auid=1000 ses=7 msg='op=login id=1000 exe="/usr/bin/lightdm" hostname=arch32-testing-pentium4 addr=? terminal=/dev/tty7 res=success'
Feb 12 11:57:48 arch32-testing-pentium4 kernel: audit: type=1112 audit(1613127468.816:104): pid=9829 uid=0 auid=1000 ses=7 msg='op=login id=1000 exe="/usr/bin/lightdm" hostname=arch32-testing-pentium4 addr=? terminal=/dev/tty7 res=success'
Feb 12 11:57:55 arch32-testing-pentium4 kaccess[9880]: Xlib XKB extension major= 1  minor= 0
Feb 12 11:57:56 arch32-testing-pentium4 kaccess[9880]: QStandardPaths: XDG_RUNTIME_DIR not set, defaulting to '/tmp/runtime-guest'
Feb 12 11:57:58 arch32-testing-pentium4 kaccess[9880]: "Session bus not found\nTo circumvent this problem try the following command (with Linux and bash)\nexport $(dbus-launch)"
Feb 12 11:58:00 arch32-testing-pentium4 kgpg[9909]: QStandardPaths: XDG_RUNTIME_DIR not set, defaulting to '/tmp/runtime-guest'
Feb 12 11:58:01 arch32-testing-pentium4 kgpg[9909]: QStandardPaths: XDG_RUNTIME_DIR not set, defaulting to '/tmp/runtime-guest'
Feb 12 11:58:01 arch32-testing-pentium4 kgpg[9909]: QStandardPaths: XDG_RUNTIME_DIR not set, defaulting to '/tmp/runtime-guest'
Feb 12 11:58:01 arch32-testing-pentium4 kgpg[9909]: "Session bus not found\nTo circumvent this problem try the following command (with Linux and bash)\nexport $(dbus-launch)"

 148 PackagesBug ReportMediumLow xfce4-power-man crashes Closed
100%
Task Description
Feb 12 12:00:29 arch32-testing-pentium4 kernel: audit: type=1130 audit(1613127629.283:106): pid=1 uid=0 auid=4294967295 ses=4294967295 msg='unit=systemd-coredump@0-9938-0 comm="systemd" exe="/usr/lib/systemd/systemd" hostname=? addr=? terminal=? res=success'
Feb 12 12:00:31 arch32-testing-pentium4 systemd-coredump[9939]: [🡕] Process 9886 (xfce4-power-man) of user 1000 dumped core.
                                                                
                                                                Stack trace of thread 9886:
                                                                #0  0x00000000b6fb37b4 g_log_structured_array (libglib-2.0.so.0 + 0x557b4)
                                                                #1  0x00000000b6fb3cdc g_log_default_handler (libglib-2.0.so.0 + 0x55cdc)
                                                                #2  0x00000000b6fb5224 g_logv (libglib-2.0.so.0 + 0x57224)
                                                                #3  0x00000000b6fb5485 g_log (libglib-2.0.so.0 + 0x57485)
                                                                #4  0x000000000041a4cf n/a (xfce4-power-manager + 0x64cf)
                                                                #5  0x00000000b6b5498d __libc_start_main (libc.so.6 + 0x1e98d)
                                                                #6  0x000000000041aa75 n/a (xfce4-power-manager + 0x6a75)
                                                                
                                                                Stack trace of thread 9901:
                                                                #0  0x00000000b7f12549 __kernel_vsyscall (linux-gate.so.1 + 0x549)
                                                                #1  0x00000000b6c22117 __poll (libc.so.6 + 0xec117)
                                                                #2  0x00000000b7000125 n/a (libglib-2.0.so.0 + 0xa2125)
                                                                #3  0x00000000b6faba46 g_main_context_iteration (libglib-2.0.so.0 + 0x4da46)
                                                                #4  0x00000000b6fabaa1 n/a (libglib-2.0.so.0 + 0x4daa1)
                                                                #5  0x00000000b6fda93e n/a (libglib-2.0.so.0 + 0x7c93e)
                                                                #6  0x00000000b6cfe39f start_thread (libpthread.so.0 + 0x839f)
                                                                #7  0x00000000b6c2db6a __clone (libc.so.6 + 0xf7b6a)
Feb 12 12:00:31 arch32-testing-pentium4 kernel: audit: type=1131 audit(1613127631.393:107): pid=1 uid=0 auid=4294967295 ses=4294967295 msg='unit=systemd-coredump@0-9938-0 comm="systemd" exe="/usr/lib/systemd/systemd" hostname=? addr=? terminal=? res=success'
 149 PackagesBug ReportMediumLow xfce desktop doesn't start Closed
100%
Task Description

no task description

 150 PackagesBug ReportMediumLow MATE doesn't start up Closed
100%
Task Description

no task description

 151 PackagesBug ReportMediumLow Gnome cannot be installed Closed
100%
Task Description

:: installing mutter (3.38.3-1.0) breaks dependency ‘libmutter-6.so=0-32’ required by gnome-shell

let’s try to push mutter, making most of gnome happy, most likely breaking gnome-shell (if not
already broken).

 152 PackagesBug ReportMediumLow evolution cannot be installed or upgraded Closed
100%
Task Description

:: installing evolution-data-server (3.38.3-1.1) breaks dependency ‘libedataserver-1.2.so=24-32’ required by evolution

 153 PackagesBug ReportMediumLow plasma cannot be installed or updated Closed
100%
Task Description

:: removing user-manager breaks dependency ‘user-manager’ required by plasma-meta

 154 PackagesBug ReportMediumLow gedit fails to start Closed
100%
Task Description

gedit: error while loading shared libraries: libtepl-5.so.0: cannot open shared object file: No such file or directory

 155 PackagesBug ReportMediumLow Display Manager GDM doesn't work Closed
100%
Task Description

We get the nice message “Oh no! Something has gone wrong”

 156 PackagesBug ReportMediumLow Cinnamon fails to start Closed
100%
Task Description

Funny, but actually not really helping:

Feb 17 20:42:17 arch32-stable-pentium4 cinnamon-session[3846]: CRITICAL: t+0.01217s: We failed, but the fail whale is dead. Sorry....
 157 PackagesBug ReportMediumLow gnome-control-center and epiphany don't start due to un ...Closed
100%
Task Description

Feb 19 10:22:46 arch32-stable-pentium4 gnome-control-center.desktop[10992]: gnome-control-center: symbol lookup error: /usr/lib/libwebkit2gtk-4.0.so.37: undefined symbol: wpe_fdo_initialize_shm

 158 PackagesBug ReportMediumLow protobuf python bindings fail to build Closed
100%
Task Description

OK (skipped=10)
Traceback (most recent call last):

File "/usr/lib/python3.9/site-packages/packaging/version.py", line 57, in parse
  return Version(version)
File "/usr/lib/python3.9/site-packages/packaging/version.py", line 298, in __init__
  raise InvalidVersion("Invalid version: '{0}'".format(version))

packaging.version.InvalidVersion: Invalid version: ‘/build/protobuf/src/protobuf’

During handling of the above exception, another exception occurred:

Traceback (most recent call last):

File "/build/protobuf/src/protobuf-3.12.4/python/setup.py", line 251, in <module>
  setup(
File "/usr/lib/python3.9/site-packages/setuptools/__init__.py", line 153, in setup
  return distutils.core.setup(**attrs)
File "/usr/lib/python3.9/distutils/core.py", line 148, in setup
  dist.run_commands()
File "/usr/lib/python3.9/distutils/dist.py", line 966, in run_commands
  self.run_command(cmd)
File "/usr/lib/python3.9/distutils/dist.py", line 985, in run_command
  cmd_obj.run()
File "/usr/lib/python3.9/site-packages/setuptools/command/test.py", line 232, in run
  self.run_tests()
File "/usr/lib/python3.9/contextlib.py", line 124, in __exit__
  next(self.gen)
File "/usr/lib/python3.9/site-packages/setuptools/command/test.py", line 169, in project_on_sys_path
  working_set.__init__()
File "/usr/lib/python3.9/site-packages/pkg_resources/__init__.py", line 552, in __init__
  self.add_entry(entry)
File "/usr/lib/python3.9/site-packages/pkg_resources/__init__.py", line 608, in add_entry
  for dist in find_distributions(entry, True):
File "/usr/lib/python3.9/site-packages/pkg_resources/__init__.py", line 2059, in find_on_path
  path_item_entries = _by_version_descending(filtered)
File "/usr/lib/python3.9/site-packages/pkg_resources/__init__.py", line 2029, in _by_version_descending
  return sorted(names, key=_by_version, reverse=True)
File "/usr/lib/python3.9/site-packages/pkg_resources/__init__.py", line 2027, in _by_version
  return [packaging.version.parse(part) for part in parts]
File "/usr/lib/python3.9/site-packages/pkg_resources/__init__.py", line 2027, in <listcomp>
  return [packaging.version.parse(part) for part in parts]
File "/usr/lib/python3.9/site-packages/packaging/version.py", line 59, in parse
  return LegacyVersion(version)
File "/usr/lib/python3.9/site-packages/packaging/version.py", line 127, in __init__
  warnings.warn(

DeprecationWarning: Creating a LegacyVersion has been deprecated and will be removed in the next major release
=⇒ ERROR: A failure occurred in check().

  Aborting...

=⇒ ERROR: Build failed, check /var/lib/archbuild/staging-pentium4/abaumann/build

both i686 and pentium4

 159 PackagesBug ReportMediumLow prjtrellis doesn't build Closed
100%
Task Description

Running Sphinx v3.5.1
/bin/sh: line 1: git: command not found
making output directory… done
WARNING: html_static_path entry ‘_static’ does not exist

Theme error:
sphinx_rtd_theme is no longer a hard dependency since version 1.4.0. Please install it manually.(pip install sphinx_rtd_theme)
{’code2docs’: {}, ‘docs2code’: {}}
make: *** [Makefile:24: html] Error 2

If I remember correctly, then some Spinx schemes need yarn to build, so they are no longer
buildable.
This means all packages needing that theme for documentation purposes are failing.

Maybe buildable without documentation for now?

 160 PackagesBug ReportMediumLow konqueror fails to work Closed
100%
Task Description

re.so.8 error messages, re.so.9 is in stable

and then segfaults in libQt5WebEngineCore

 161 PackagesBug ReportMediumLow buildbot fails to build Closed
100%
Task Description

/usr/bin/true install -e pkg
/usr/bin/true install mock wheel buildbot
cd www/build_common; yarn install –pure-lockfile
yarn install v1.22.10
warning package.json: No license field
warning buildbot-build-common@1.0.0: No license field
[1/4] Resolving packages… [2/4] Fetching packages… make: *** [Makefile:63: frontend_deps] Segmentation fault (core dumped)

 165 PackagesBug ReportMediumLow xorgproto check() fails Closed
100%
Task Description

———————————– output ———————————– stderr:
Traceback (most recent call last):

File "/build/xorgproto/src/xorgproto-2021.3/scripts/keysym-generator.py", line 18, in <module>
  import libevdev

ModuleNotFoundError: No module named ‘libevdev’

root cause is python-libevdev not building:

Theme error:
sphinx_rtd_theme is no longer a hard dependency since version 1.4.0. Please install it manually.(pip install sphinx_rtd_theme)

another victim of documentation generation..

 167 Packages: StableBug ReportVery LowMedium Kernel lost crypto support necessary for iwd Closed
100%
Task Description

With linux 5.11.1.arch1-1.0, iwd no longer works for associating with WPA2 access points. On attempting to start the service, the journal reads:

iwd: RC4 support not found
iwd: The following options are missing in the kernel:
iwd:    CONFIG_CRYPTO_USER_API_SKCIPHER
iwd:    CONFIG_CRYPTO_ECB
iwd:    CONFIG_CRYPTO_ARC4

It would be nice to have these options enabled in the kernel config, so as to continue support for the iwd package.

 168 DevopsBug ReportMediumLow i486 slaves are no longer working Closed
100%
Task Description

+ exec setarch i486 systemd-nspawn -q -D /var/lib/archbuild/staging-i486/root -E PATH=/usr/local/sbin:/usr/local/bin:/usr/bin –register=no –keep-unit –as-pid2 –bind=/var/cache/archbuild32 pacman -Syuu –noconfirm
error: failed to initialize alpm library

 170 PackagesBug ReportVery LowLow [libarchive] zstd minimum version dependency - zstd>=1. ...Closed
100%
Task Description

libarchive has a dependency upon the zstd libzstd with a version recent enough to provide the symbol ZSTD_minCLevel.

PKGBUILD:
depends=(... 'zstd>=1.3.6')

This is an issue when upgrading pacman to support the zstd packaging format.
pacman must depend upon libarchive>=3.3.3 for zstd compression support.
libarchive will then depend upon zstd>=1.3.6 for the symbol ZSTD_minCLevel.

Without these, upgrading an old Arch Linux system gives the incomplete - so unhelpful - error message:

error: could not open file /var/cache/pacman/pkg/something.pkg.tar.zst: Unrecognized archive format

How does pacman recognize an archive format? If the user does not already know the answer, they are in trouble. And, mistakenly circumventing the package compression to force an upgrade of pacman alone will lead to even more trouble, since pacman itself is not the source of the problem.

 171 PackagesBug ReportVery LowLow [pacman] libarchive minimum version dependency - libarc ...Closed
100%
Task Description

pacman has a dependency upon libarchive with a version recent enough to support zstd compression.

depends=(... 'libarchive>=3.3.3')

This is an issue when upgrading pacman to support the zstd packaging format.
pacman must depend upon libarchive>=3.3.3 for zstd compression support.
libarchive will then depend upon zstd>=1.3.6 for the symbol ZSTD_minCLevel.

Without these, upgrading an old Arch Linux system gives the incomplete - so unhelpful - error message:

error: could not open file /var/cache/pacman/pkg/something.pkg.tar.zst: Unrecognized archive format

How does pacman recognize an archive format? If the user does not already know the answer, they are in trouble. And, mistakenly circumventing the package compression to force an upgrade of pacman alone will lead to even more trouble, since pacman itself is not the source of the problem.

 173 PackagesBug ReportVery LowMedium supertux is broken (depends on libboostfilesystem 0.72  ...Closed
100%
Task Description

Supertux needs to be rebuilt as it currently depends on the wrong version of libboostfilesystem.

https://www.archlinux32.org/packages/i686/community/supertux/ not satisfiable dependency: “libboost_filesystem.so.1.72.0” (link)
not satisfiable dependency: “libboost_locale.so.1.72.0” (link)

This affects all architectures (i686 and pentium4)

 174 PackagesBug ReportMediumLow firefox 87.0 doesn't build Closed
100%
Task Description

Again, we get into out-of-memory situations with rust:

pentium4
41:24.75   cargo:warning=src/vector_type.h:502:11: warning: ‘void* memcpy(void*, const void*, size_t)’ writing to an object of type ‘struct glsl::vec4’ with no trivial copy-assignment; use copy-assignment or copy-initialization instead [-Wclass-memaccess]
41:24.75   cargo:warning=  502 |     memcpy(&v, p, sizeof(v));
41:24.75   cargo:warning=      |     ~~~~~~^~~~~~~~~~~~~~~~~~
41:24.75   cargo:warning=In file included from src/gl.cc:78:
41:24.75   cargo:warning=src/glsl.h:1772:8: note: ‘struct glsl::vec4’ declared here
41:24.75   cargo:warning= 1772 | struct vec4 {
41:24.75   cargo:warning=      |        ^~~~
41:24.75   cargo:warning=
41:24.75   cargo:warning=cc1plus: out of memory allocating 21906724 bytes after a total of 213745664 bytes

i686
 6:42.75    Compiling geckoservo v0.0.1 (/build/firefox/src/firefox-87.0/servo/ports/geckolib)
Process Process-1:
Traceback (most recent call last):
  File "/usr/lib/python3.9/multiprocessing/process.py", line 315, in _bootstrap
    self.run()
  File "/usr/lib/python3.9/multiprocessing/process.py", line 108, in run
    self._target(*self._args, **self._kwargs)
  File "/build/firefox/src/firefox-87.0/testing/mozbase/mozsystemmonitor/mozsystemmonitor/resourcemonitor.py", line 141, in _collect
    while not _poll(pipe, poll_interval=sleep_interval):
  File "/build/firefox/src/firefox-87.0/testing/mozbase/mozsystemmonitor/mozsystemmonitor/resourcemonitor.py", line 107, in _poll
    return pipe.poll(poll_interval)
  File "/usr/lib/python3.9/multiprocessing/connection.py", line 262, in poll
    return self._poll(timeout)
  File "/usr/lib/python3.9/multiprocessing/connection.py", line 429, in _poll
    r = wait([self], timeout)
  File "/usr/lib/python3.9/multiprocessing/connection.py", line 936, in wait
    ready = selector.select(timeout)
  File "/usr/lib/python3.9/selectors.py", line 416, in select
    fd_event_list = self._selector.poll(timeout)
KeyboardInterrupt
52:46.35 make[4]: *** [/build/firefox/src/firefox-87.0/config/makefiles/rust.mk:348: force-cargo-library-build] Interrupt
52:46.35 make[3]: *** [/build/firefox/src/firefox-87.0/config/recurse.mk:72: toolkit/library/rust/target] Interrupt
52:46.35 make[2]: *** [/build/firefox/src/firefox-87.0/config/recurse.mk:34: compile] Interrupt
52:46.35 make[1]: *** [/build/firefox/src/firefox-87.0/config/rules.mk:355: default] Interrupt

Rust is 1.51.0 on both pentium4 and i686.

Showing tasks 101 - 150 of 350 Page 3 of 7 - 1 - 2 - 3 - 4 - 5 - Last >>

Available keyboard shortcuts

Tasklist

Task Details

Task Editing