Bugs in Archlinux32 packages, specific to 32-bit issues.

Bugs  FS#2  to  FS#92  have been recovered and may be incomplete, the
recovered Google/Bing cache data can be found here.

IDCategoryTask TypePrioritySeveritySummary  ascStatusProgress
 65 Packages: StableBug ReportMediumLow [qt5-styleplugins] incompatile QT version Closed
100%
Task Description

Attached to Project: Archlinux32
Opened by bill auger - 08.04.2019
 FS#65  - [qt5-styleplugins] incompatile QT version

i can not get any QT program to start while that is installed - they complain about mixed QT versions

it looks like qt5-styleplugins was built with the [testing] repo enabled, with qt5-base-5.12.2, while other QT-base programs were built against qt5-base-5.12.1

  Comments (4)
  Related Tasks (0/0)

bill auger commented on 08.04.2019 16:47

$ qv4l2
Cannot mix incompatible Qt library (version 0x50c02) with this library (version 0x50c01)
Aborted (core dumped)
$ sudo octopi
Cannot mix incompatible Qt library (version 0x50c02) with this library (version 0x50c01)
Aborted
$ sudo calamares
Cannot mix incompatible Qt library (version 0x50c02) with this library (version 0x50c01)
Aborted
$ sudo qtox
[16:43:22.069 UTC] :0 : Fatal: Cannot mix incompatible Qt library (version 0x50c02) with this library (version 0x50c01)
Aborted

Admin
Erich Eckner commented on 08.04.2019 19:36

where does qt see this versions?
The symbols in e.g. usr/lib/libQt5-Widgets.so.5.* do not have the least version part:

14 0×02 0x08a28110 Qt_5.10

    Qt_5.9 

15 0×02 0x08a28111 Qt_5.11

    Qt_5.10 

16 0×00 0x08a28112 Qt_5.12

    Qt_5.11 

required from libQt5Core.so.5:

0x08a28112 0x00 22 Qt_5.12
0x00058a25 0x00 03 Qt_5

required from libQt5Widgets.so.5:

0x00058a25 0x00 02 Qt_5

bill auger commented on 30.04.2019 11:16

i read on the web somewhere that all QT programs search the system very aggressively searching for any QT libs it can find (and presumably selecting the newest)

what i have noticed is that this is an interaction between the packages: ‘qt5-styleplugins’ (the themes) and ‘qt5ct’ (the config system) - the presence of either package alone is not enough to cause the problem - the problem occurs only when the ‘gtk2’ theme is selected in the qt5ct config - this is the default configuration that the parabola LXDE liveISO boots into, that config is prepared when building the ISO; so i did not notice this before; but on a manual install, i noticed the qt5ct program crashes when selecting the theme

to reproduce this symptom:
install both ‘qt5-styleplugins’ and ‘qt5ct’ launch qt5ct
select gtk2 from the “Style” select options

$ gdb qt5ct
GNU gdb (GDB) 8.2.1
Copyright (C) 2018 Free Software Foundation, Inc.
License GPLv3+: GNU GPL version 3 or later
This is free software: you are free to change and redistribute it.
There is NO WARRANTY, to the extent permitted by law.
Type “show copying” and “show warranty” for details.
This GDB was configured as “i686-pc-linux-gnu”.
Type “show configuration” for configuration details.
For bug reporting instructions, please see:
.
Find the GDB manual and other documentation resources online at:

  .

For help, type “help”.
Type “apropos word” to search for commands related to “word”… Reading symbols from qt5ct…(no debugging symbols found)…done.
(gdb) run
Starting program: /usr/bin/qt5ct
[Thread debugging using libthread_db enabled]
Using host libthread_db library “/usr/lib/libthread_db.so.1”.
[New Thread 0xb3c40b40 (LWP 9932)]

(qt5ct:9928): dbind-WARNING : 11:06:08.450: Couldn’t connect to accessibility bus: Failed to connect to socket /tmp/dbus-nltxAHENFr: Connection refused
Configuration path: “/home/bill/.config/qt5ct” Shared QSS paths: (”/home/bill/.local/share/qt5ct/qss”, “/usr/local/share/qt5ct/qss”, “/usr/share/qt5ct/qss”, “/usr/share/gdm/qt5ct/qss”, “/var/lib/menu-xdg/qt5ct/qss”)
Shared color scheme paths: (”/home/bill/.local/share/qt5ct/colors”, “/usr/local/share/qt5ct/colors”, “/usr/share/qt5ct/colors”, “/usr/share/gdm/qt5ct/colors”, “/var/lib/menu-xdg/qt5ct/colors”)
[New Thread 0xb1ff2b40 (LWP 9933)]
libEGL warning: DRI2: failed to authenticate
libEGL warning: MESA-LOADER: failed to open swrast (search paths /usr/lib/dri) libEGL warning: MESA-LOADER: failed to open swrast (search paths /usr/lib/dri) libEGL warning: DRI2: failed to authenticate
libEGL warning: MESA-LOADER: failed to open swrast (search paths /usr/lib/dri) libEGL warning: MESA-LOADER: failed to open swrast (search paths /usr/lib/dri) [this is where i selected the GTK theme] Cannot mix incompatible Qt library (version 0x50c02) with this library (version 0x50c01) Thread 1 “qt5ct” received signal SIGABRT, Aborted.
0xb7fd5841 in kernel_vsyscall ()
(gdb) bt
#0 0xb7fd5841 in
kernel_vsyscall ()
#1 0xb6a2e746 in raise () at /usr/lib/libc.so.6
#2 0xb6a181e3 in abort () at /usr/lib/libc.so.6
#3 0xb6da9775 in () at /usr/lib/libQt5Core.so.5
#4 0xb6dc09d1 in () at /usr/lib/libQt5Core.so.5
#5 0xb1268540 in () at /usr/lib/qt/plugins/styles/libqgtk2style.so
#6 0xb125620b in () at /usr/lib/qt/plugins/styles/libqgtk2style.so
#7 0xb126b3ad in () at /usr/lib/qt/plugins/styles/libqgtk2style.so
#8 0xb79ecd9a in QStyleFactory::create(QString const&) () at /usr/lib/libQt5Widgets.so.5
#9 0x00411d2f in ()
#10 0x0042e2fd in ()
#11 0x0042e4a3 in ()
#12 0xb6fbc929 in QMetaObject::activate(QObject*, int, int, void
) ()

  at /usr/lib/libQt5Core.so.5

#13 0xb7a85121 in QComboBox::activated(QString const&) () at /usr/lib/libQt5Widgets.so.5
#14 0xb7a876d4 in () at /usr/lib/libQt5Widgets.so.5
#15 0xb7a8a454 in () at /usr/lib/libQt5Widgets.so.5
#16 0xb7a90276 in () at /usr/lib/libQt5Widgets.so.5
#17 0xb6fbc861 in QMetaObject::activate(QObject*, int, int, void) ()
at /usr/lib/libQt5Core.so.5
#18 0xb7a853c1 in QComboBoxPrivateContainer::itemSelected(QModelIndex const&) ()
at /usr/lib/libQt5Widgets.so.5
#19 0xb7a85ae0 in QComboBoxPrivateContainer::eventFilter(QObject*, QEvent*) ()
at /usr/lib/libQt5Widgets.so.5
#20 0xb6f908cc in QCoreApplicationPrivate::sendThroughObjectEventFilters(QObject*, QEvent*)
() at /usr/lib/libQt5Core.so.5
#21 0xb79708b8 in QApplicationPrivate::notify_helper(QObject*, QEvent*) ()
at /usr/lib/libQt5Widgets.so.5
#22 0xb7979108 in QApplication::notify(QObject*, QEvent*) () at /usr/lib/libQt5Widgets.so.5
#23 0xb6f90bc5 in QCoreApplication::notifyInternal2(QObject*, QEvent*) ()
at /usr/lib/libQt5Core.so.5
#24 0xb7977e61 in QApplicationPrivate::sendMouseEvent(QWidget*, QMouseEvent*, QWidget*, QWid– get*, QWidget
, QPointer&, bool, bool) () at /usr/lib/libQt5Widgets.so.5
#25 0xb79d636c in () at /usr/lib/libQt5Widgets.so.5
#26 0xb79d90ea in () at /usr/lib/libQt5Widgets.so.5
#27 0xb79708c9 in QApplicationPrivate::notify_helper(QObject*, QEvent*) () at /usr/lib/libQt5Widgets.so.5
#28 0xb7978aa2 in QApplication::notify(QObject*, QEvent*) () at /usr/lib/libQt5Widgets.so.5
#29 0xb6f90bc5 in QCoreApplication::notifyInternal2(QObject*, QEvent*) () at /usr/lib/libQt5Core.so.5
#30 0xb735fb9e in QGuiApplicationPrivate::processMouseEvent(QWindowSystemInterfacePrivate::MouseEvent*) () at /usr/lib/libQt5Gui.so.5
#31 0xb7361172 in QGuiApplicationPrivate::processWindowSystemEvent(QWindowSystemInterfacePrivate::WindowSystemEvent*) () at /usr/lib/libQt5Gui.so.5
#32 0xb73358c5 in QWindowSystemInterface::sendWindowSystemEvents(QFlags) () at /usr/lib/libQt5Gui.so.5
#33 0xb3f5b0ad in () at /usr/lib/libQt5XcbQpa.so.5
#34 0xb602792e in g_main_context_dispatch () at /usr/lib/libglib-2.0.so.0
#35 0xb60299ea in () at /usr/lib/libglib-2.0.so.0
#36 0xb6029a36 in g_main_context_iteration () at /usr/lib/libglib-2.0.so.0
#37 0xb6feaceb in QEventDispatcherGlib::processEvents(QFlags) () at /usr/lib/libQt5Core.so.5
#38 0xb6f8f656 in QEventLoop::exec(QFlags) () at /usr/lib/libQt5Core.so.5
#39 0xb6f97eeb in QCoreApplication::exec() () at /usr/lib/libQt5Core.so.5
#40 0x0040d36d in ()
#41 0xb6a19a49 in __libc_start_main () at /usr/lib/libc.so.6
#42 0x0040d505 in ()
(gdb)

bill auger commented on 08.05.2019 15:39

it looks like the latest rebuilds have leap-frogged the version conflict

previously:

Cannot mix incompatible Qt library (version 0x50c02) with this library (version 0x50c01)

today:

Cannot mix incompatible Qt library (version 0x50c02) with this library (version 0x50c03)

my guess is that either ‘qt5-styleplugins’ or ‘qt5ct’ still need a rebuild

Google Cache

Bing Cache

282PackagesBug ReportMediumLow[qt5-webengine] fails with LTO and one definition ruleNew
0%
Task Description

After hours of compiling:

release/../../../../qtwebengine/src/3rdparty/chromium/base/memory/ref_counted.h:145:19: warning: type ‘struct RefCountedThreadSafeBase’ violates the C++ One Definition Ru
le [-Wodr]
  145 | class BASE_EXPORT RefCountedThreadSafeBase {
      |                   ^
/usr/src/debug/qtwebengine/src/3rdparty/chromium/base/memory/ref_counted.h:145:19: note: a different type is defined in another translation unit
/usr/src/debug/qtwebengine/src/3rdparty/chromium/base/memory/ref_counted.h:229:16: note: the first difference of corresponding 
definitions is field ‘needs_adopt_ref_’
/usr/src/debug/qtwebengine/src/3rdparty/chromium/base/memory/ref_counted.h:145:19: note: a type with different number of fields is defined in another translation unit
release/../../../../qtwebengine/src/3rdparty/chromium/base/memory/ref_counted.h:387:7: warning: type ‘struct RefCountedThreadSafe’ violates the C++ One Definition Rule [-
Wodr]
  387 | class RefCountedThreadSafe : public subtle::RefCountedThreadSafeBase {
      |       ^
/usr/src/debug/qtwebengine/src/3rdparty/chromium/base/memory/ref_counted.h:387:7: note: a type with different bases is defined in another translation unit
release/../../../../qtwebengine/src/3rdparty/chromium/base/memory/ref_counted.h:387:7: warning: type ‘struct RefCountedThreadSafe’ violates the C++ One Definition Rule [-Wodr]
  387 | class RefCountedThreadSafe : public subtle::RefCountedThreadSafeBase {
      |       ^
/usr/src/debug/qtwebengine/src/3rdparty/chromium/base/memory/ref_counted.h:387:7: note: a type with different bases is defined in another translation unit
/usr/src/debug/qtwebengine/src/core/net/cookie_monster_delegate_qt.h:87:38: warning: type ‘struct CookieMonsterDelegateQt’ violates the C++ One Definition Rule [-Wodr]
/usr/src/debug/qtwebengine/src/core/net/cookie_monster_delegate_qt.h:87:38: note: a type with different bases is defined in another translation unit
/usr/src/debug/qtwebengine/src/core/net/cookie_monster_delegate_qt.h:104:10: warning: type of ‘setCookie’ does not match original declaration [-Wlto-type-mismatch]
/usr/src/debug/qtwebengine/src/core/net/cookie_monster_delegate_qt.cpp:134:6: note: ‘setCookie’ was previously declared here
/usr/src/debug/qtwebengine/src/core/net/cookie_monster_delegate_qt.cpp:134:6: note: code may be misoptimized unless ‘-fno-strict-aliasing’ is used
/usr/src/debug/qtwebengine/src/core/net/cookie_monster_delegate_qt.h:113:10: warning: type of ‘setHasFilter’ does not match original declaration [-Wlto-type-mismatch]
/usr/src/debug/qtwebengine/src/core/net/cookie_monster_delegate_qt.cpp:212:6: note: ‘setHasFilter’ was previously declared here
/usr/src/debug/qtwebengine/src/core/net/cookie_monster_delegate_qt.cpp:212:6: note: code may be misoptimized unless ‘-fno-strict-aliasing’ is used
/usr/src/debug/qtwebengine/src/core/net/cookie_monster_delegate_qt.h:108:10: warning: type of ‘deleteAllCookies’ does not match original declaration [-Wlto-type-mismatch]
/usr/src/debug/qtwebengine/src/core/net/cookie_monster_delegate_qt.cpp:183:6: note: ‘deleteAllCookies’ was previously declared here
/usr/src/debug/qtwebengine/src/core/net/cookie_monster_delegate_qt.cpp:183:6: note: code may be misoptimized unless ‘-fno-strict-aliasing’ is used
/usr/src/debug/qtwebengine/src/core/net/cookie_monster_delegate_qt.h:107:10: warning: type of ‘deleteSessionCookies’ does not match original declaration [-Wlto-type-mismatch]
/usr/src/debug/qtwebengine/src/core/net/cookie_monster_delegate_qt.cpp:171:6: note: ‘deleteSessionCookies’ was previously declared here
/usr/src/debug/qtwebengine/src/core/net/cookie_monster_delegate_qt.cpp:171:6: note: code may be misoptimized unless ‘-fno-strict-aliasing’ is used
/usr/src/debug/qtwebengine/src/core/net/cookie_monster_delegate_qt.h:105:10: warning: type of ‘deleteCookie’ does not match original declaration [-Wlto-type-mismatch]
/usr/src/debug/qtwebengine/src/core/net/cookie_monster_delegate_qt.cpp:158:6: note: ‘deleteCookie’ was previously declared here
/usr/src/debug/qtwebengine/src/core/net/cookie_monster_delegate_qt.cpp:158:6: note: code may be misoptimized unless ‘-fno-strict-aliasing’ is used
/usr/src/debug/qtwebengine/src/core/net/cookie_monster_delegate_qt.h:106:10: warning: type of ‘getAllCookies’ does not match original declaration [-Wlto-type-mismatch]
/usr/src/debug/qtwebengine/src/core/net/cookie_monster_delegate_qt.cpp:129:6: note: ‘getAllCookies’ was previously declared here
/usr/src/debug/qtwebengine/src/core/net/cookie_monster_delegate_qt.cpp:129:6: note: code may be misoptimized unless ‘-fno-strict-aliasing’ is used
/usr/src/debug/qtwebengine/src/core/net/cookie_monster_delegate_qt.h:102:10: warning: type of ‘hasCookieMonster’ does not match original declaration [-Wlto-type-mismatch]
/usr/src/debug/qtwebengine/src/core/net/cookie_monster_delegate_qt.cpp:124:6: note: ‘hasCookieMonster’ was previously declared here
/usr/src/debug/qtwebengine/src/core/net/cookie_monster_delegate_qt.cpp:124:6: note: code may be misoptimized unless ‘-fno-strict-aliasing’ is used
/usr/src/debug/qtwebengine/src/core/api/qwebenginecallback_p.h:136:12: warning: virtual table of type ‘struct CallbackSharedDataPointer’ violates one definition rule [-Wodr]
/usr/src/debug/qtwebengine/src/core/api/qwebenginecallback_p.h:136:12: note: the conflicting type defined in another translation unit has virtual table with more entries
/usr/src/debug/qtwebengine/src/core/api/qwebenginecallback_p.h:136:12: warning: virtual table of type ‘struct CallbackSharedDataPointer’ violates one definition rule [-Wodr]
/usr/src/debug/qtwebengine/src/core/api/qwebenginecallback_p.h:136:12: note: the conflicting type defined in another translation unit has virtual table with more entries
/usr/src/debug/qtwebengine/src/core/api/qwebenginecallback_p.h:136:12: warning: virtual table of type ‘struct CallbackSharedDataPointer’ violates one definition rule [-Wodr]
/usr/src/debug/qtwebengine/src/core/api/qwebenginecallback_p.h:136:12: note: the conflicting type defined in another translation unit has virtual table with more entries
/usr/src/debug/qtwebengine/src/core/api/qwebenginecallback_p.h:136:12: warning: virtual table of type ‘struct CallbackSharedDataPointer’ violates one definition rule [-Wodr]
/usr/src/debug/qtwebengine/src/core/api/qwebenginecallback_p.h:136:12: note: the conflicting type defined in another translation unit has virtual table with more entries
/usr/src/debug/qtwebengine/src/core/api/qwebenginecallback_p.h:136:12: warning: virtual table of type ‘struct CallbackSharedDataPointer’ violates one definition rule [-Wodr]
/usr/src/debug/qtwebengine/src/core/api/qwebenginecallback_p.h:136:12: note: the conflicting type defined in another translation unit has virtual table with more entries
during RTL pass: pro_and_epilogue
release/gen/services/network/public/mojom/content_security_policy.mojom.h: In member function ‘Clone’:
release/gen/services/network/public/mojom/content_security_policy.mojom.h:1666:1: internal compiler error: in find_oldest_value_reg, at regcprop.cc:460

This is sort of unmaintainable..

 44 PackagesBug ReportMediumLow [qt5-webengine] fatal error: QtUiPlugin ... Closed
100%
Task Description

20.06.2018 - In file included from /root/qt5-webengine/src/qtwebengine-everywhere-src-5.11.0/src/plugins/qwebengineview/qwebengineview_plugin.cpp:40:

290PackagesBug ReportMediumLow[qt6-webengine] fails building with nodeNew
0%
Task Description
Traceback (most recent call last):
  File "/build/qt6-webengine/src/build/src/core/RelWithDebInfo/i686/../../../../../qtwebengine-everywhere-src-6.3.2/src/3rdparty/chromium/third_party/node/node.py", line 62, in <module>
    RunNode(sys.argv[1:])
  File "/build/qt6-webengine/src/build/src/core/RelWithDebInfo/i686/../../../../../qtwebengine-everywhere-src-6.3.2/src/3rdparty/chromium/third_party/node/node.py", line 57, in RunNode
    raise RuntimeError('Command \'%s\' failed\n%s' % (' '.join(cmd), err))
RuntimeError: Command '/usr/bin/node ../../../../../qtwebengine-everywhere-src-6.3.2/src/3rdparty/chromium/third_party/devtools-frontend/src/scripts/build/compress_files.js --file_list __third_party_devtools-frontend_src_compress__build_qt6-webengine_src_build_src_core_target_toolchain_target__rule..rsp' failed

This is presumably knitting together some documentation, node is currently broken on Arch32..

248PackagesBug ReportMediumLow[Qt6] Illegal OpcodesNew
0%
Task Description
кві 09 19:43:36 alizee kernel: traps: telegram-deskto[1252] trap invalid opcode ip:b3f990c3 sp:bf8d0010 error:0 in libQt6Gui.so.6.2.3[b3ecb000+873000]

Stack trace of thread 1252:
#0  0x00000000b3f990c3 n/a (libQt6Gui.so.6 + 0xce0c3)
#1  0x00000000b7f67ecb call_init (ld-linux.so.2 + 0x5ecb)
#2  0x00000000b7f67fc4 _dl_init (ld-linux.so.2 + 0x5fc4)
#3  0x00000000b7f7f58a _dl_start_user (ld-linux.so.2 + 0x1d58a)
ELF object binary architecture: Intel 80386
кві 09 19:45:11 alizee kernel: traps: qbittorrent[1353] trap invalid opcode ip:b60c69b6 sp:bfd54e70 error:0 in libQt6Core.so.6.2.3[b5f22000+2fd000]

Stack trace of thread 1353:
#0  0x00000000b60c69b6 _Z26qCalculateGrowingBlockSizeiii (libQt6Core.so.6 + 0x21c9b6)
#1  0x00000000b60c6aa9 _ZN10QArrayData8allocateEPPS_iiiNS_16AllocationOptionE (libQt6Core.so.6 + 0x21caa9)
#2  0x00000000b61e9cef n/a (libQt6Core.so.6 + 0x33fcef)
#3  0x00000000b61139a4 _ZN18QThreadStorageDataC2EPFvPvE (libQt6Core.so.6 + 0x2699a4)
#4  0x00000000b656aca9 n/a (libQt6Network.so.6 + 0x31ca9)
#5  0x00000000b7f68ecb call_init (ld-linux.so.2 + 0x5ecb)
#6  0x00000000b7f68fc4 _dl_init (ld-linux.so.2 + 0x5fc4)
#7  0x00000000b7f8058a _dl_start_user (ld-linux.so.2 + 0x1d58a)
ELF object binary architecture: Intel 80386
294PackagesBug ReportVery LowHigh[qtile] importlib.metadata.PackageNotFoundError: No pac...Assigned
0%
Task Description

When running qtile I get the following error message:

[qtile] importlib.metadata.PackageNotFoundError: No package metadata was found for qtile

Running qtile on Arch Linux works as expected.

$ qtile start
Traceback (most recent call last):
  File "/usr/bin/qtile", line 33, in <module>
    sys.exit(load_entry_point('qtile==0.18.1', 'console_scripts', 'qtile')())
  File "/usr/bin/qtile", line 22, in importlib_load_entry_point
    for entry_point in distribution(dist_name).entry_points
  File "/usr/lib/python3.10/importlib/metadata/__init__.py", line 957, in distribution
    return Distribution.from_name(distribution_name)
  File "/usr/lib/python3.10/importlib/metadata/__init__.py", line 548, in from_name
    raise PackageNotFoundError(name)
importlib.metadata.PackageNotFoundError: No package metadata was found for qtile
$ pacman -Qi qtile
Name            : qtile
Version         : 0.18.1-3.0
Description     : A full-featured, pure-Python tiling window manager
Architecture    : pentium4
URL             : http://www.qtile.org
Licenses        : MIT
Groups          : None
Provides        : None
Depends On      : gdk-pixbuf2  glibc  libnotify  librsvg  pango  python-cairocffi  python-cffi  python-xcffib  python-gobject  python-setuptools
Optional Deps   : alsa-utils: for volume widget
                  canto-daemon: for canto widget
                  cmus: for cmus widget
                  jupyter_console: for interaction with qtile via Jupyter
                  khal: for khal_calendar widget
                  libpulse: for pulse_volume and pulseaudio_ffi widget [installed]
                  lm_sensors: for sensors widget [installed]
                  moc: for moc widget
                  python-dbus-next: for utils, notifications and several widgets
                  python-iwlib: for wlan widget
                  python-keyring: for imapwidget widget
                  python-mpd2: mpd2widget widget
                  python-psutil: graph, net and memory widget [installed]
                  python-pywlroots: for experimental wayland support
                  python-setproctitle: change process name to qtile
                  python-xdg: launchbar widget
Required By     : None
Optional For    : None
Conflicts With  : None
Replaces        : None
Installed Size  : 3.25 MiB
Packager        : Andreas Baumann <mail@andreasbaumann.cc>
Build Date      : Mon 04 Oct 2021 12:02:58
Install Date    : Mon 26 Sep 2022 13:33:45
Install Reason  : Explicitly installed
Install Script  : Yes
Validated By    : Signature
$ sudo pacman -Syu
:: Synchronizing package databases...
 core downloading...
 extra downloading...
 community downloading...
:: Starting full system upgrade...
 there is nothing to do
 96 Packages: StableBug ReportMediumMedium [rust] broken or missing backend Closed
100%
Task Description
shell> echo > rust.rc <<EOF
fn main() {
        println!( "Hello Rust! " );
}
EOF

shell> rustc rust.rs
error: failed to find a `codegen-backends` folder in the sysroot candidates:
* /usr
* /usr

Presumably the i686 folders are moved around in PKGBUILD to form lib32
libraries for rust on 64-bit.

 316 PackagesBug ReportMediumLow [rust] exhausts virtual memory Closed
100%
Task Description
/usr/bin/ld: error: lib/libLLVMSupport.a(FileOutputBuffer.cpp.o)(.text._ZN12_GLOBAL__N_112OnDiskBufferD0Ev
) is too large (0x105 bytes)
/usr/bin/ld: failed to set dynamic section sizes: memory exhausted
collect2: error: ld returned 1 exit status

maybe we have to resort to cross-compiling rust in the end..

 331 PackagesBug ReportMediumLow [rust] rebootstrap Closed
100%
Task Description

seems like the virtual memory exhaustion is fixed in the newest version.
We have to bootstrap again (mainly for librsvg and firefox).

 253 PackagesBug ReportMediumLow [rust] rebuilds but fails to build anything Closed
100%
Task Description

Bootstrapping rust via rust159-bin leads to:

error[E0463]: can't find crate for `std`

error[E0463]: can't find crate for `core`

error[E0463]: can't find crate for `compiler_builtins`

Basically, rust is broken.

 285 PackagesBug ReportVery LowLow [s-tui] /usr/bin/s-tui missing Closed
100%
Task Description

In s-tui 1.1.3-2.0, the run script /usr/bin/s-tui is missing. Only the files under /usr/lib/python3.10 are included in the package.

In the upstream Arch package the file is included: https://archlinux.org/packages/community/any/s-tui/

Rebuilding the package on a pentium4 machine resulted in a correct package. I cannot find any Arch Linux 32 specific PKGBUILD, so I’m not sure where this problem comes from. Maybe just rebuilding the package will fix it.

20Packages: Build-listBug ReportMediumLow[sagemath-doc] building documentation using Sphinx segf...New
0%
Task Description

[tutorial ] Saved pickle file: citations.pickle
[tutorial ] Exception occurred:
[tutorial ] File “/usr/lib/python2.7/site-packages/sphinx/environment/init.py”, line 152, in dump
[tutorial ] pickle.dump(env, f, pickle.HIGHEST_PROTOCOL)
[tutorial ] MemoryError
[tutorial ] The full traceback has been saved in /tmp/sphinx-err-kSNZ9A.log, if you want to report the issue to the developers.
[tutorial ] Please also report this if it was a user error, so that a better error message can be provided next time.
[tutorial ] A bug report can be filed in the tracker at . Thanks!
Build finished. The built documents can be found in /build/sagemath-doc/src/sage-8.1/src/doc/html/ja/tutorial
/startdir/PKGBUILD: line 79: 2540 Segmentation fault (core dumped) python2 sage_setup/docbuild –no-pdf-links -k all html
==&gt; ERROR: A failure occurred in build().

  Aborting...

==&gt; ERROR: Build failed, check /data/archbuild/staging-i686/copy/build

Bing Cache

 32 PackagesBug ReportMediumLow [samba] faileure to start due to linking issues Closed
100%
Task Description

11.04.2018 - samba-4.7.5-1.0 smbclient-4.7.5-1.0 libwbclient-4.7.6-1.0. Downgrading those three packages to 4.7.4 as a temporary workaround.

 5 PackagesBug ReportMediumLow [sbcl] fails to compile - Arch Linux Closed
100%
Task Description

16.12.2017 - The best, I can get is trying to compile the git HEAD with clisp (instead of sbcl). However, this still errors with: entering make-target-2.sh

 255 PackagesBug ReportVery LowLow [seamonkey] Does not start, needs rebuilding Closed
100%
Task Description

Seamonkey is built with now outdated versions of libffi and icu (69). Neither pentium4 nor i686 build starts right now.

 8 Packages: Build-listBug ReportMediumLow [skia-sharp] [skia-sharp58] build fails Closed
100%
Task Description

Attached to Project: Archlinux32
Opened by Erich Eckner - 11.11.2017
Last edited by Andreas Baumann - 12.11.2017
 FS#8  - [skia-sharp] [skia-sharp58] build fails

/startdir/PKGBUILD: line 63: bin/gn: No such file or directory

strange about this:
- works on x86_64
- bin/gn is there and executable
Closed by Andreas Baumann
12.11.2017 14:19
Reason for closing: Won’t implement
Additional comments about closing:

blacklist, no visible 32-bit support.

Comments (7)

Admin
Andreas Baumann commented on 12.11.2017 12:29

When compiling on 64-bit I get several binaries:

src/depot_tools/gn
src/skia/gn
src/skia/buildtools/linux64/gn
src/skia/bin/gn

maybe one with linux32 is missing?
Admin
Andreas Baumann commented on 12.11.2017 12:30

Other things in PKGBUILD:

export PYTHON=’/usr/bin/pyton2’

This hardly works. :-) Admin
Andreas Baumann commented on 12.11.2017 12:31

The line with bin/gn is a little bit tricky. I’ll try to put an absolute path there..
Admin
Andreas Baumann commented on 12.11.2017 12:32

I also don’t like the ideas of pushd and popd everywhere..
Admin
Andreas Baumann commented on 12.11.2017 12:33

file bin/gn
bin/gn: ELF 64-bit LSB executable, x86-64, version 1 (SYSV), dynamically linked, interpreter /lib64/ld-linux-x86-64.so.2, for GNU/Linux 2.6.26, BuildID[sha1]=6d551c57efec95b400b9890f89a18e407396c917, stripped

So the file not found means: it exists, but has not been compiled for the correct architecture.
Admin
Andreas Baumann commented on 12.11.2017 13:57

So, removing bin/gn and calling python2 tools/git-sync-deps fetches me a new copy.
Admin
Andreas Baumann commented on 12.11.2017 14:14

So tools/git-sync-deps does:

   subprocess.check_call(
  [sys.executable,
   os.path.join(os.path.dirname(deps_file_path), 'bin', 'fetch-gn')])

which has:

gn_path = ‘buildtools/linux64/gn’ if ‘linux’ in sys.platform else \

      'buildtools/mac/gn'     if 'darwin' in sys.platform else \
      'buildtools/win/gn.exe'

fetching things from Chromium:

f.write(urllib2.urlopen('https://chromium-gn.storage-download.googleapis.com/' + sha1).read())

Changing linux64 to linux32 in a naive approach didn’t fetch a bin/gn.

So I would actually blacklist both packages.

Google Cache

 230 PackagesBug ReportVery LowLow [SPAM] Closed
100%
Task Description

no task description

 269 PackagesBug ReportVery LowLow [spam] Closed
100%
Task Description

spam

 270 PackagesBug ReportVery LowLow [spam] Closed
100%
Task Description

spam

 271 PackagesBug ReportVery LowLow [spam] Closed
100%
Task Description

spam

 272 PackagesBug ReportVery LowLow [spam] Closed
100%
Task Description

spam

 286 PackagesBug ReportVery LowLow [speedtest-cli] missing scripts Closed
100%
Task Description

The package speedtest-cli (2.1.3-2.0) is missing the following scripts:
usr/bin/speedtest
usr/bin/speedtest-cli

These are generated scripts, but they should be included in the package.

 249 PackagesBug ReportMediumLow [ssh] strange output instead of scp Closed
100%
Task Description
scp -rC user@server:directory .
\033[?2004lD0711 0 directory

Enabling -vvv just makes scp hang.

No clue, what the problem could be here..

 110 PackagesBug ReportVery LowLow [syslog-ng] is built without systemd support Closed
100%
Task Description

The packages for syslog-ng since version 3.27.1-1.0 appears to have been built without systemd support. Although their PKGBUILD runs configure with –enable-systemd, running syslog-ng –version shows Enable-Systemd: off. The official Arch x86_64 package (at version 3.28.1-1) doesn’t exhibit this problem.

I tried building the package locally on i686 using the official Arch PKGBUILD and could not reproduce the problem. My locally built version correctly finds libsystemd during configure, and gets built with systemd support. This leads me to believe the problem happens somewhere in the Archlinux32 build process.


The practical upshot of the problem is that the systemd unit file supplied with syslog-ng lists it as a Type=notify service, but when it fails to notify systemd after startup, systemd eventually kills it and restarts it repeatedly:

Jul 24 07:32:31 wolfie systemd[1]: Starting System Logger Daemon "default" instance...
Jul 24 07:32:32 wolfie syslog-ng[18977]: syslog-ng starting up; version='3.28.1'
Jul 24 07:34:01 wolfie systemd[1]: syslog-ng@default.service: start operation timed out. Terminating.
Jul 24 07:34:01 wolfie syslog-ng[18977]: syslog-ng shutting down; version='3.28.1'
Jul 24 07:34:01 wolfie systemd[1]: syslog-ng@default.service: Failed with result 'timeout'.
Jul 24 07:34:01 wolfie systemd[1]: Failed to start System Logger Daemon "default" instance.
Jul 24 07:34:02 wolfie systemd[1]: syslog-ng@default.service: Scheduled restart job, restart counter is at 1.
Jul 24 07:34:02 wolfie systemd[1]: Stopped System Logger Daemon "default" instance.
Jul 24 07:34:02 wolfie systemd[1]: Starting System Logger Daemon "default" instance...
 304 PackagesBug ReportMediumCritical [systemd] 251.2 breaking systems, cannot login Closed
100%
Task Description
Assertion 'close_nointr(fd) != -EBADF' failed at src/basic/fd-util.c:76, function safe_close(). Aborting.

The temporary workaround is to comment out ‘pam_system.so’ in system-auth and system-login..

325PackagesBug ReportVery LowHigh[terminus] crashes with message undefined symbol: cairo...Unconfirmed
0%
Task Description

Starting terminus gives following error:

from ._cairo import *  # noqa: F401,F403
ImportError: /usr/lib/python3.10/site-packages/cairo/_cairo.cpython-310-i386-linux-gnu.so: undefined symbol: cairo_tee_surface_index

Bug seens to be related to

https://bugs.archlinux.org/task/77367

There is generall mess on cairo related files for different architectures (pentium4, i486, i686) - some packages for one architecture are outdated, while for other archictectures are up to date, for instance:

  • python-cairo i486/extra : 1.21.0-1.0
  • python-cairo i686/extra : 1.23.0-3.0
  • python-cairo pentium4/extra : 1.23.0-3.0
 26 PackagesBug ReportMediumLow [texlive] partially linked against old libmpfr Closed
100%
Task Description

Attached to Project: Archlinux32
Opened by Andreas Baumann - 02.02.2018
Last edited by Andreas Baumann - 02.02.2018
 FS#26  - [texlive] partially linked against old libmpfr

( 9/18) Updating TeXLive filename database… texlua: error while loading shared libraries: libmpfr.so.4: cannot open shared object file: No such file or directory

Triggered a forced rebuild of textlive-core and texlive-bin.
Closed by Andreas Baumann
02.02.2018 10:15
Reason for closing: Fixed

  Comments (0)

Google Cache

 4 Packages: StableBug ReportMediumLow [virtualbox-guest-utils] 5.2.0 version broken  Closed
100%
Task Description

Attached to Project: Archlinux32
Opened by Andreas Baumann - 07.11.2017
Last edited by Andreas Baumann - 17.12.2017
 FS#4  - [virtualbox-guest-utils] 5.2.0 version broken

When starting a virtual machine you get:

VBoxClient: VBoxClient (seamless): failed to start. Stage: Setting guest IRQ filter mask Error: VERR_INTERNAL_ERROR

The solution is to use the guest ISO 5.2.1 for now till the package is upgraded.
Closed by Andreas Baumann
17.12.2017 20:22
Reason for closing: Fixed
Additional comments about closing:

Seems to work now. the modules load, the desktop adapts nicely. mouse works. closing this one.

Comments

Admin
Erich Eckner commented on 17.12.2017 18:46

is this still the case with 5.2.2?
Admin
Andreas Baumann commented on 17.12.2017 18:52

I’ll have to test on a virtualbox vm..

Google Cache

Bing Cache

310PackagesBug ReportMediumLow[webkit2gtk] needs a running RubyNew
0%
Task Description
<internal:/usr/lib/ruby/3.0.0/rubygems/core_ext/kernel_require.rb>:85:in `require': cannot load such file -- date_core (LoadError)
        from <internal:/usr/lib/ruby/3.0.0/rubygems/core_ext/kernel_require.rb>:85:in `require'
        from /usr/lib/ruby/3.0.0/date.rb:4:in `<top (required)>'
        from <internal:/usr/lib/ruby/3.0.0/rubygems/core_ext/kernel_require.rb>:85:in `require'
        from <internal:/usr/lib/ruby/3.0.0/rubygems/core_ext/kernel_require.rb>:85:in `require'
        from /build/webkit2gtk/src/webkitgtk-2.38.2/Source/JavaScriptCore/generator/GeneratedFile.rb:24:in `<top (required)>'
        from /build/webkit2gtk/src/webkitgtk-2.38.2/Source/JavaScriptCore/generator/DSL.rb:25:in `require_relative'
        from /build/webkit2gtk/src/webkitgtk-2.38.2/Source/JavaScriptCore/generator/DSL.rb:25:in `<top (required)>'
        from /build/webkit2gtk/src/webkitgtk-2.38.2/Source/JavaScriptCore/generator/main.rb:24:in `require_relative'
        from /build/webkit2gtk/src/webkitgtk-2.38.2/Source/JavaScriptCore/generator/main.rb:24:in `<main>'

And ruby is currently broken..

 85 Packages: StableBug ReportMediumLow [wireguard-arch] Package not being updated alongside ke ...Closed
100%
Task Description

The last update to this package was August 25, despite several new kernel builds since this. As a result, the package does not work and users must use …

 64 Packages: StableBug ReportMediumLow [wireguard] wireguard-arch-0.0.20190227-3.0-i686 does n ...Closed
100%
Task Description

Attached to Project: Archlinux32
Opened by Daniel Moch - 16.03.2019
 FS#64  - [wireguard] wireguard-arch-0.0.20190227-3.0-i686 does not work with 4.20.10.arch1-1.0 kernel

running `modprobe wireguard` yields `modprobe: ERROR: could not insert ‘wireguard’: Exec format error`

  Comments (1)
  Related Tasks (0/0)

Daniel Moch commented on 16.03.2019 11:52

I should add that downgrading to wireguard-arch 0.0.20190123-7.0 resolved the issue.

Google Cache

 234 PackagesBug ReportMediumLow [xlockmore] just segfaults when started Closed
100%
Task Description

no task description

 306 PackagesBug ReportMediumLow [Xorg] fails on i686 Closed
100%
Task Description

For instance xauth cannot find libXext.so.6.

 225 PackagesBug ReportHighCritical [zstd] 1.5.1, zstd compressed ramdisk fails to load pro ...Closed
100%
Task Description

kernel issue with some network card and/or
systemd subservice not working add all

I cannot login remotely or locally.

System drops to maintainance shell..

Not a single systemd subdaemon is working..

This also effectively kills all i486 build machines..

 358 PackagesBug ReportMediumLow All versions of samba > 4.17.5 are broken Closed
100%
Task Description

Either because of ICU or LDB incompatibilites.
tdb, ldb, samba and python have to be rebuild.

 302 DevopsFeature RequestVery LowLow Are you gonna continue 486 support? Closed
100%
Task Description

https://www.tomshardware.com/news/linux-removes-486-cpu-support

486 will be removed from the kernel and especially from 6.1 onwards rust will be integrated with the kernel…

 134 PackagesBug ReportVery LowLow arm-none-eabi-gdb requires rebuild Closed
100%
Task Description

arm-none-eabi-gdb is broken due to not satisfiable dependency: “libpython3.8.so.1.0” After recompiling from upstream it works.

 211 PackagesBug ReportVery LowMedium asp32 Closed
100%
Task Description

asp32 fails to export/checkout anything.

Esample:

# asp32 export pacman
fatal: unable to update url base from redirection:

asked for: https://git.archlinux.org/svntogit/packages.git/info/refs?service=git-upload-pack
 redirect: https://gitlab.archlinux.org/explore/groups

error: failed to update remote packages64

 223 PackagesBug ReportVery LowLow asp32 is broken Closed
100%
Task Description

It needs to be updated to reflect the switch to gitlab.archlinux.org

 185 PackagesBug ReportMediumLow blender doesn't build Closed
100%
Task Description
- openexr missing header files?
/usr/include/openvdb/Types.h:10:10: fatal error: OpenEXR/half.h: No such file or directory
   10 | #include <OpenEXR/half.h>
      |          ^~~~~~~~~~~~~~~~
compilation terminated.

openexr 2->3 upgrade breaks blender in openvdb

openvdb needs numpy, which needs cythonize, which segfaults.
176DevopsFeature RequestMediumLowbring back archiso32 dual bootNew
0%
Task Description

We should make archiso32 be able to build a i686- and x86_64-bootable iso, again. This is really handy on a usb stick as a rescue system.

The problem with the old dual iso is, that I had to do the i686 iso from scratch, because upstream changed from build.sh to putting everything into mkarchiso. Now, everything is steered from a profile file.

So either, we find a way to make a profile for multiple architectures, or we need to patch mkarchiso to do that for us - and maybe upstream these changes.

 259 PackagesBug ReportVery LowLow Broken GSL package Closed
100%
Task Description

GSL broken dependence with inkscape:

$ inkscape
inkscape: error while loading shared libraries: libgsl.so.27: cannot open shared object file: No such file or directory

Check the library:

# pacman -Ss gsl
extra/gsl 2.7-1.0 [instalado]

# pacman -Ql gsl | grep ‘\.so’ gsl /usr/lib/libgsl.so
gsl /usr/lib/libgsl.so.25
gsl /usr/lib/libgsl.so.25.1.0
gsl /usr/lib/libgslcblas.so
gsl /usr/lib/libgslcblas.so.0
gsl /usr/lib/libgslcblas.so.0.0.0

162PackagesBug ReportMediumLowbrowsers based on Chromium break in secomp sanboxingNew
0%
Task Description

Everything using chromium/seccomp jailing breaks currently including chromium due to missing IA-32
rules in libseccomp and/or chromium itself.

Firefox seems to work fine.
epiphany works.
midori works.
luakit works.

Chromium crashes with sigsegv (I would expect something which reminds me of a seccomp syscall?).

konqueror, falkon, qutebrowser are based on qt5-webengine. They all open up but then don’t render a page (issuing the seccomp error messages attached below).

vivaldi the same, but as it is closed source, we cannot fix it.

 161 PackagesBug ReportMediumLow buildbot fails to build Closed
100%
Task Description

/usr/bin/true install -e pkg
/usr/bin/true install mock wheel buildbot
cd www/build_common; yarn install –pure-lockfile
yarn install v1.22.10
warning package.json: No license field
warning buildbot-build-common@1.0.0: No license field
[1/4] Resolving packages… [2/4] Fetching packages… make: *** [Makefile:63: frontend_deps] Segmentation fault (core dumped)

 334 PackagesBug ReportVery LowLow Calibre is out of date and will not start Closed
100%
Task Description

The latest version of calibre is 6.16.

The version in the repositories is 6.11.0-1.0 and unfortunately will no longer start.

[keith@Arch32 ~]$ calibre
Failed to import PyQt module: PyQt6.QtNetwork with error: /usr/lib/python3.10/site-packages/PyQt6/QtNetwork.abi3.so: undefined symbol: _ZN16QNetworkDatagram7destroyEP23QNetworkDatagramPrivate, version Qt_6
Traceback (most recent call last):
  File "/usr/bin/calibre", line 21, in <module>
    sys.exit(calibre())
  File "/usr/lib/calibre/calibre/gui_launch.py", line 72, in calibre
    from calibre.gui2.main import main
  File "/usr/lib/calibre/calibre/gui2/__init__.py", line 13, in <module>
    from qt.core import (
ImportError: cannot import name 'QNetworkProxyFactory' from 'qt.core' (/usr/lib/calibre/qt/core.py)
[keith@Arch32 ~]$ pacman -Qi calibre
Name            : calibre
Version         : 6.11.0-1.0
Description     : Ebook management application
Architecture    : pentium4
URL             : https://calibre-ebook.com
Licenses        : GPL3
Groups          : None
Provides        : None
Depends On      : hunspell  hyphen  icu  jxrlib  libmtp  libstemmer  libusb  libwmf  mathjax  mtdev  optipng  podofo
                  python-apsw  python-beautifulsoup4  python-cchardet  python-css-parser  python-cssselect  python-dateutil
                  python-dnspython  python-feedparser  python-html2text  python-html5-parser  python-jeepney  python-lxml
                  python-markdown  python-mechanize  python-msgpack  python-netifaces  python-pdftotext  python-pillow
                  python-psutil  python-py7zr  python-pychm  python-pycryptodome  python-pygments  python-pyqt6
                  python-pyqt6-webengine  python-regex  python-unrardll  python-zeroconf  qt6-imageformats  qt6-svg
                  qt6-webengine  ttf-liberation  uchardet  udisks2
Optional Deps   : poppler: required for converting pdf to html [installed]
                  speech-dispatcher: TTS support in the viewer
Required By     : None
Optional For    : None
Conflicts With  : calibre-common  calibre-python3
Replaces        : calibre-common  calibre-python3
Installed Size  : 91.69 MiB
Packager        : Andreas Baumann <mail@andreasbaumann.cc>
Build Date      : Thu 12 Jan 2023 05:31:50 GMT
Install Date    : Tue 24 Jan 2023 10:15:48 GMT
Install Reason  : Explicitly installed
Install Script  : No
Validated By    : Signature

[keith@Arch32 ~]$ 
 233 PackagesBug ReportVery LowLow Cannot install smplayer due to broken dependency Closed
100%
Task Description

I am currently unable to install smplayer in testing due to a broken dependency of mpv

[~]$ sudo pacman -S smplayer
resolving dependencies...
warning: cannot resolve "libplacebo.so=120-32", a dependency of "mpv"
warning: cannot resolve "mpv", a dependency of "smplayer"
:: The following package cannot be upgraded due to unresolvable dependencies:
      smplayer

:: Do you want to skip the above package for this upgrade? [y/N] y
looking for conflicting packages...
 there is nothing to do
 105 Packages: StableBug ReportMediumLow chromium crash in blocked syscalls (libseccomp) Closed
100%
Task Description

chromium apparently also has trouble in some seccomp jailing:

 ../../sandbox/linux/seccomp-bpf-helpers/sigsys_handlers.cc:**CRASHING**:seccomp-bpf failure in syscall 0403
../../sandbox/linux/seccomp-bpf-helpers/sigsys_handlers.cc:**CRASHING**:seccomp-bpf failure in syscall 0403
../../sandbox/linux/seccomp-bpf-helpers/sigsys_handlers.cc:**CRASHING**:seccomp-bpf failure in syscall 0403
../../sandbox/linux/seccomp-bpf-helpers/sigsys_handlers.cc:**CRASHING**:seccomp-bpf failure in syscall 0403
../../sandbox/linux/seccomp-bpf-helpers/sigsys_handlers.cc:**CRASHING**:seccomp-bpf failure in syscall 0403
../../sandbox/linux/seccomp-bpf-helpers/sigsys_handlers.cc:**CRASHING**:seccomp-bpf failure in syscall 0403
../../sandbox/linux/seccomp-bpf-helpers/sigsys_handlers.cc:**CRASHING**:seccomp-bpf failure in syscall 0403
../../sandbox/linux/seccomp-bpf-helpers/sigsys_handlers.cc:**CRASHING**:seccomp-bpf failure in syscall 0403
../../sandbox/linux/seccomp-bpf-helpers/sigsys_handlers.cc:**CRASHING**:seccomp-bpf failure in syscall 0403
[1201:1210:0227/131355.020958:FATAL:gpu_data_manager_impl_private.cc(990)] The display compositor is frequently crashing. Goodbye.

[1]+  Trace/breakpoint trap   (core dumped) chromium
287PackagesFeature RequestVery LowLowchromium not able to buildAssigned
0%
Task Description

Wait unfortunately i found a patch through which chromium would compile on x86

please try to build chromium using those patches

https://github.com/void-linux/void-packages/blob/master/srcpkgs/chromium/patches/reenable-linux-i686-builds.patch https://github.com/void-linux/void-packages/blob/master/srcpkgs/chromium/patches/chromium-i686-vaapi-fpermissive.patch https://github.com/void-linux/void-packages/blob/master/srcpkgs/chromium/patches/chromium-105-bitmap-include.patch https://github.com/void-linux/void-packages/blob/master/srcpkgs/chromium/patches/chromium-105-browser-include.patch

70Packages: Build-listBug ReportMediumLowchromium not available for i686 (fails in compiler intr...New
0%
Task Description

Attached to Project: Archlinux32
Opened by Andreas Baumann - 10.05.2019
FS#70 - chromium needs SSE2

chromium starts, but every page it loads ends in “Aw snap” and on the console:

Check failed: cpu.has_sse2().

Google Cache

 156 PackagesBug ReportMediumLow Cinnamon fails to start Closed
100%
Task Description

Funny, but actually not really helping:

Feb 17 20:42:17 arch32-stable-pentium4 cinnamon-session[3846]: CRITICAL: t+0.01217s: We failed, but the fail whale is dead. Sorry....
Showing tasks 101 - 150 of 350 Page 3 of 7 - 1 - 2 - 3 - 4 - 5 - Last >>

Available keyboard shortcuts

Tasklist

Task Details

Task Editing