Bugs in Archlinux32 packages, specific to 32-bit issues.

Bugs  FS#2  to  FS#92  have been recovered and may be incomplete, the
recovered Google/Bing cache data can be found here.

IDCategoryTask TypePrioritySeveritySummaryStatus  descProgress
 165 PackagesBug ReportMediumLow xorgproto check() fails Closed
100%
Task Description

———————————– output ———————————– stderr:
Traceback (most recent call last):

File "/build/xorgproto/src/xorgproto-2021.3/scripts/keysym-generator.py", line 18, in <module>
  import libevdev

ModuleNotFoundError: No module named ‘libevdev’

root cause is python-libevdev not building:

Theme error:
sphinx_rtd_theme is no longer a hard dependency since version 1.4.0. Please install it manually.(pip install sphinx_rtd_theme)

another victim of documentation generation..

 174 PackagesBug ReportMediumLow firefox 87.0 doesn't build Closed
100%
Task Description

Again, we get into out-of-memory situations with rust:

pentium4
41:24.75   cargo:warning=src/vector_type.h:502:11: warning: ‘void* memcpy(void*, const void*, size_t)’ writing to an object of type ‘struct glsl::vec4’ with no trivial copy-assignment; use copy-assignment or copy-initialization instead [-Wclass-memaccess]
41:24.75   cargo:warning=  502 |     memcpy(&v, p, sizeof(v));
41:24.75   cargo:warning=      |     ~~~~~~^~~~~~~~~~~~~~~~~~
41:24.75   cargo:warning=In file included from src/gl.cc:78:
41:24.75   cargo:warning=src/glsl.h:1772:8: note: ‘struct glsl::vec4’ declared here
41:24.75   cargo:warning= 1772 | struct vec4 {
41:24.75   cargo:warning=      |        ^~~~
41:24.75   cargo:warning=
41:24.75   cargo:warning=cc1plus: out of memory allocating 21906724 bytes after a total of 213745664 bytes

i686
 6:42.75    Compiling geckoservo v0.0.1 (/build/firefox/src/firefox-87.0/servo/ports/geckolib)
Process Process-1:
Traceback (most recent call last):
  File "/usr/lib/python3.9/multiprocessing/process.py", line 315, in _bootstrap
    self.run()
  File "/usr/lib/python3.9/multiprocessing/process.py", line 108, in run
    self._target(*self._args, **self._kwargs)
  File "/build/firefox/src/firefox-87.0/testing/mozbase/mozsystemmonitor/mozsystemmonitor/resourcemonitor.py", line 141, in _collect
    while not _poll(pipe, poll_interval=sleep_interval):
  File "/build/firefox/src/firefox-87.0/testing/mozbase/mozsystemmonitor/mozsystemmonitor/resourcemonitor.py", line 107, in _poll
    return pipe.poll(poll_interval)
  File "/usr/lib/python3.9/multiprocessing/connection.py", line 262, in poll
    return self._poll(timeout)
  File "/usr/lib/python3.9/multiprocessing/connection.py", line 429, in _poll
    r = wait([self], timeout)
  File "/usr/lib/python3.9/multiprocessing/connection.py", line 936, in wait
    ready = selector.select(timeout)
  File "/usr/lib/python3.9/selectors.py", line 416, in select
    fd_event_list = self._selector.poll(timeout)
KeyboardInterrupt
52:46.35 make[4]: *** [/build/firefox/src/firefox-87.0/config/makefiles/rust.mk:348: force-cargo-library-build] Interrupt
52:46.35 make[3]: *** [/build/firefox/src/firefox-87.0/config/recurse.mk:72: toolkit/library/rust/target] Interrupt
52:46.35 make[2]: *** [/build/firefox/src/firefox-87.0/config/recurse.mk:34: compile] Interrupt
52:46.35 make[1]: *** [/build/firefox/src/firefox-87.0/config/rules.mk:355: default] Interrupt

Rust is 1.51.0 on both pentium4 and i686.

 186 PackagesBug ReportMediumLow [pacman] /etc/makeconf.conf for i486 contains flags res ...Closed
100%
Task Description

-fstack-clash-protection
-fcf-protection

We have to investiagate if one of them (or both) are
introducing illegal opcodes for i486..

 204 PackagesBug ReportMediumLow gdbm 1.21 fails in test 31 (convert new database format ...Closed
100%
Task Description

The bug report has been sent upstream to GDBM directly. This is too important to just ignore the failure.. (make check || true)

 213 PackagesBug ReportMediumLow [libffi] libffi.so7/libffi.so.8 major ABI bump Closed
100%
Task Description

make and guile made it half (and broken) to stable.
breaking the cycle required a shim package libffi33 in build-support.
packages depending of libffi are rescheduled and need to be rebuilt first, pushing libffi.so.8 to stable now would make
‘make/guile’ work again, but break a lot of other stuff!

 215 PackagesBug ReportMediumLow firefox 93.0 (and seamonkey 2.53.9.1) doesn't build Closed
100%
Task Description
 2:52.15 error: `[u32; 2]` is forbidden as the type of a const generic parameter
 2:52.15   --> /build/firefox/src/firefox-93.0/third_party/rust/packed_simd/src/codegen/llvm.rs:20:44
 2:52.15    |
 2:52.15 20 | pub unsafe fn __shuffle_vector2<const IDX: [u32; 2], T, U>(x: T, y: T) -> U
 2:52.15    |                                            ^^^^^^^^
 2:52.15    |
 2:52.15    = note: the only supported types are integers, `bool` and `char`
 2:52.15    = help: more complex types are supported with `#![feature(adt_const_params)]`
 2:52.15 error: `[u32; 4]` is forbidden as the type of a const generic parameter
 2:52.15   --> /build/firefox/src/firefox-93.0/third_party/rust/packed_simd/src/codegen/llvm.rs:30:44
 2:52.15    |
 2:52.15 30 | pub unsafe fn __shuffle_vector4<const IDX: [u32; 4], T, U>(x: T, y: T) -> U
 2:52.15    |                                            ^^^^^^^^
 2:52.15    |
 2:52.15    = note: the only supported types are integers, `bool` and `char`
 2:52.15    = help: more complex types are supported with `#![feature(adt_const_params)]`
 2:52.15 error: `[u32; 8]` is forbidden as the type of a const generic parameter
 2:52.15   --> /build/firefox/src/firefox-93.0/third_party/rust/packed_simd/src/codegen/llvm.rs:40:44
 2:52.15    |
 2:52.15 40 | pub unsafe fn __shuffle_vector8<const IDX: [u32; 8], T, U>(x: T, y: T) -> U
 2:52.15    |                                            ^^^^^^^^
 2:52.15    |
 2:52.15    = note: the only supported types are integers, `bool` and `char`
 2:52.15    = help: more complex types are supported with `#![feature(adt_const_params)]`
 2:52.15 error: `[u32; 16]` is forbidden as the type of a const generic parameter
 2:52.15   --> /build/firefox/src/firefox-93.0/third_party/rust/packed_simd/src/codegen/llvm.rs:50:45
 2:52.15    |
 2:52.15 50 | pub unsafe fn __shuffle_vector16<const IDX: [u32; 16], T, U>(x: T, y: T) -> U
 2:52.15    |                                             ^^^^^^^^^
 2:52.15    |
 2:52.15    = note: the only supported types are integers, `bool` and `char`
 2:52.15    = help: more complex types are supported with `#![feature(adt_const_params)]`
 2:52.15 error: `[u32; 32]` is forbidden as the type of a const generic parameter
 2:52.15   --> /build/firefox/src/firefox-93.0/third_party/rust/packed_simd/src/codegen/llvm.rs:60:45
 2:52.15    |
 2:52.15 60 | pub unsafe fn __shuffle_vector32<const IDX: [u32; 32], T, U>(x: T, y: T) -> U
 2:52.15    |                                             ^^^^^^^^^
 2:52.15    |
 2:52.15    = note: the only supported types are integers, `bool` and `char`
 2:52.15    = help: more complex types are supported with `#![feature(adt_const_params)]`
 2:52.15 error: `[u32; 64]` is forbidden as the type of a const generic parameter
 2:52.15   --> /build/firefox/src/firefox-93.0/third_party/rust/packed_simd/src/codegen/llvm.rs:70:45
 2:52.15    |
 2:52.15 70 | pub unsafe fn __shuffle_vector64<const IDX: [u32; 64], T, U>(x: T, y: T) -> U
 2:52.15    |                                             ^^^^^^^^^
 2:52.15    |
 2:52.15    = note: the only supported types are integers, `bool` and `char`
 2:52.15    = help: more complex types are supported with `#![feature(adt_const_params)]`
 2:52.35    Compiling num_cpus v1.13.0
 2:53.13    Compiling fluent-langneg v0.13.0
 2:53.15    Compiling intl_pluralrules v7.0.1
 2:53.59    Compiling intl-memoizer v0.5.1
 2:55.32    Compiling gl_generator v0.14.0
 2:55.37    Compiling cose-c v0.1.5
 2:55.96    Compiling time v0.1.43
 2:56.01    Compiling iovec v0.1.4
 2:56.05    Compiling atty v0.2.14
 2:56.21 For more information about this error, try `rustc --explain E0557`.
 2:56.23    Compiling net2 v0.2.37
 2:56.24 The following warnings were emitted during compilation:
 2:56.25 warning: Cannot set `RUSTC_BOOTSTRAP=1` from build script of `packed_simd v0.3.4 (https://github.com/hsivonen/packed_simd?rev=6a16f954950401b92b4e220fbf2dfaf6f00e1fb2#6a16f954)`.
 2:56.25 note: Crates cannot set `RUSTC_BOOTSTRAP` themselves, as doing so would subvert the stability guarantees of Rust for your project.
 2:56.25 error: could not compile `packed_simd` due to 13 previous errors
 2:56.25 warning: build failed, waiting for other jobs to finish...
 3:17.66 error: build failed
 217 PackagesBug ReportMediumLow [llvm12] shim needed Closed
100%
Task Description

librsvg/rust fails because llvm is now 13 and we don’t have the llvm12-libs around anymore.
Will make a shim package.

 227 PackagesBug ReportMediumLow [object-introspection] [libosinfo] rebuild issue Closed
100%
Task Description

affects: tracker-miners tracker3-miners gnome-documents gnome-music gnome-photos nautilus

 239 PackagesBug ReportMediumLow [ffmpeg] and [ffmepg4.4] fail to build Closed
100%
Task Description
libswscale/x86/rgb2rgb_template.c: In function ‘interleaveBytes_sse2’:
libswscale/x86/rgb2rgb_template.c:1838:9: error: the register ‘xmm2’ cannot be clobbered in ‘asm’ for the current target
 1838 |         __asm__(
      |         ^

Also on i486 symbols are missing if not using LTO and probing of libraries like x264/x265 fail.

 242 PackagesBug ReportMediumLow [flac] fails to build Closed
100%
Task Description

This is just the sad state of what people do to working software:

if(CMAKE_SYSTEM_PROCESSOR STREQUAL "i686" AND HAVE_STACKREALIGN_FLAG)
    add_compile_options(-mstackrealign)
endif()

which results in nasm to fail with “unknown option -m”

a) they rewrite half of the build system without apparently understanding fully the autoconf part
b) they don’t bother to delete to autoconf part
c) they write code for porting the software apparenty without testing (why bother then in the first place?)

 253 PackagesBug ReportMediumLow [rust] rebuilds but fails to build anything Closed
100%
Task Description

Bootstrapping rust via rust159-bin leads to:

error[E0463]: can't find crate for `std`

error[E0463]: can't find crate for `core`

error[E0463]: can't find crate for `compiler_builtins`

Basically, rust is broken.

 256 PackagesBug ReportMediumLow [ISO] fails to boot, mount value too large error Closed
100%
Task Description
/init: line 477: mount: Value too large for defined data type

At least ISO 2022.04.03 is affected..

 263 PackagesBug ReportMediumLow [libnss_systemd] segfault on login Closed
100%
Task Description

Experienced with mate and xfce, logging in results in:

md-coredump@1-384-0 comm="systemd" exe="/usr/lib/systemd/systemd" hostname=? addr=? terminal=? res=success'
May 15 12:33:34 arch32 kernel: audit: type=1130 audit(1652610814.953:50): pid=1 uid=0 auid=4294967295 ses=4294967295 msg='unit=systemd-coredump@1-384-0 comm="systemd" exe="/usr/lib/systemd/systemd" hostname=? addr=? terminal=? res=success'
May 15 12:33:35 arch32 systemd-coredump[385]: Process 345 (lightdm) of user 0 dumped core.
                                              
                                              Module linux-gate.so.1 with build-id a27879231a619f481c5f61675aaa832fd638cb59
                                              Module libnss_systemd.so.2 with build-id 513870f67a61f7ea3d6e57c8f95f354de951706d
                                              Module pam_warn.so with build-id c2d0d3d8af8a67a71b5f2c65b5c1bbd307215915
                                              Module pam_deny.so with build-id 3f3db5fc2f00b0311c1055abff87446bd21ed382
                                              Module libpam_misc.so.0 with build-id f9b9c0b45bff4398cfb8af0d4ab66e20e862490a
                                              Module pam_systemd.so with build-id 7e789653df9c1d629075ca9e56b924a39ab8f30a
                                              Module pam_mail.so with build-id 113680c35df7dd7d41f77b00b004c201c4f19a09
                                              Module pam_motd.so with build-id ac0c4aa42752e17cbd95f6625873d3e84dffbabd
                                              Module pam_limits.so with build-id a229b08f2ae095fec0f9b9fcc08a9851501a47f3
                                              Module pam_keyinit.so with build-id bc58e8776715407d61b32b6d8d4bf4e7317dd98c
                                              Module pam_loginuid.so with build-id 41a858e6a28f79da7ff5800bc27195119be5626a
                                              Module pam_time.so with build-id 703a26cf2e5c055cc07ddf7f323e0eefbb84ec8a
                                              Module pam_access.so with build-id 55b6fed1bfe3f208cb32ee028c2ff06025ab3a45
                                              Module pam_env.so with build-id 055f29545a53ec4d2443001c1e03c75320988013
                                              Module pam_permit.so with build-id ebe5828bc48cb18e3dd029a2240cebb57e14f768
                                              Module libkeyutils.so.1 with build-id 5a50265493bf37e60323c71fb776cfd730bf8964
                                              Module libkrb5support.so.0 with build-id 716c0f85b8408ce69093706649d5ebaae25456b0
                                              Module libcom_err.so.2 with build-id 60116fbed67a6c3ab90da2f38c550bc1d1f79f02
                                              Module libk5crypto.so.3 with build-id 3459692a8e859eec416dcfce08e9fe69a4f1311f
                                              Module libkrb5.so.3 with build-id 5400284945ac88bb9fa911a9b987a34ed2274010
                                              Module libgssapi_krb5.so.2 with build-id 546b080b472317aeb2f04b396935e03e2bd78911
                                              Module libtirpc.so.3 with build-id 5034a25480814d17e335ca016d0299fdbdc0cae9
                                              Module pam_unix.so with build-id 3d7111b8433120fb2793be17510462b7db176197
                                              Module libp11-kit.so.0 with build-id ee4f39a2bf217877ed8f65eee72b1af45a3bf1a2
                                              Module libcrypto.so.1.1 with build-id 9f5d5eddb3c55325af7d4241cbe597a48a5b999c
                                              Module libm.so.6 with build-id 9039ae10a04fcb30d921fd5c76097c7a3f665370
                                              Module libcap.so.2 with build-id 4d323ab3b69bef5921d049778199ca62a9c7811c
                                              Module libcrypt.so.2 with build-id a66b381fec2654ed68c0491bd86e896e8d190597
                                              Module pam_systemd_home.so with build-id 4331342dd5ed0b492d732501e4dc3fa9f1bd598a
                                              Module pam_faillock.so with build-id f8f59c3134d8d7d9a3b271ff3f81f77fb8b973a2
                                              Module pam_nologin.so with build-id 64f5509dbde1de344f52af9b73711769affbe840
                                              Module pam_shells.so with build-id 24a1716196a601444b2dd1866ce46de7973ef27b
                                              Module librt.so.1 with build-id fa61d1f12a409640b8cf40cf9a23b352f1bc0552
                                              Module libblkid.so.1 with build-id 5d2cf9b1a4781b9178b53d80028a93380d91520a
                                              Module ld-linux.so.2 with build-id 595ad200cc586e2697315fb53e2d0eb7b1b9c1c1
                                              Module libdl.so.2 with build-id 1d3a3521b2e6abc69c970335373065339a553791
                                              Module libgpg-error.so.0 with build-id ad225378bc723ed6b4b8b15099198fbedfcacd08
                                              Module libcap-ng.so.0 with build-id ee0d4a32f9f1173f386abc7d685ef18dd5c29061
                                              Module libXau.so.6 with build-id ca0c911ec4ccee4b60d41ce4d8cadb6303faa158
                                              Module libpcre.so.1 with build-id 9e8433d78efdfe75dc9ca017f477cf938d804df1
                                              Module libffi.so.8 with build-id 691b36b35ab1c4821e3e97a70d774dcd69133fdc
                                              Module libresolv.so.2 with build-id f9d6b273df20a9704fc122ac781527a783638301
                                              Module libmount.so.1 with build-id 1acb539ab365dd2f5b20907ad40da36b8e9fe264
                                              Module libz.so.1 with build-id bed5219c83b00026030d38c8912fc2d9cfd33851
                                              Module libgmodule-2.0.so.0 with build-id 8f6ff76c08d4ff9075c35915c959a867bfe58cf6
                                              Module libc.so.6 with build-id 17751704b417b7760f84338ea777fd67fae6ef96
                                              Module libpthread.so.0 with build-id e41f23d77ed9ff0c67d4d63e3e272b50cd81e3cc
                                              Module libpam.so.0 with build-id 01ddafaed94ed4dbbc9126943929915326d00290
                                              Module libgcrypt.so.20 with build-id 1f9f583f3f53e6556867735a4c2f9686e19067e0
                                              Module libaudit.so.1 with build-id 1ef22adc0a368bafd37e88808dc4fe06e1d04198
                                              Module libxcb.so.1 with build-id 350f0b983356df7c00c3edfd69e60869a3074671
                                              Module libXdmcp.so.6 with build-id d3227d8950007ff94ae016a81373b7e920eb8926
                                              Module libglib-2.0.so.0 with build-id 3057954359bdc8d2b6a0e220a8a4d5e13c134cb8
                                              Module libgobject-2.0.so.0 with build-id 63a1e70bd9f4e113f1dcd15ccd533ea00ee7e67b
                                              Module libgio-2.0.so.0 with build-id f8a91d2df4aa66c093de256c755782ef7d42850c
                                              Module lightdm with build-id 3892c6848f55843ad693ca2f1997ceb91354e9d4
                                              Stack trace of thread 345:

 277 PackagesBug ReportMediumLow [emacs] rebuild fails on 486, needs librsvg Closed
100%
Task Description

/usr/src/debug/emacs-28.1/src/image.c:10009: undefined reference to `rsvg_handle_set_stylesheet’ # /usr/bin/ld: /usr/src/debug/emacs-28.1/src/image.c:10196: undefined reference to `rsvg_handle_set_stylesheet’

 304 PackagesBug ReportMediumCritical [systemd] 251.2 breaking systems, cannot login Closed
100%
Task Description
Assertion 'close_nointr(fd) != -EBADF' failed at src/basic/fd-util.c:76, function safe_close(). Aborting.

The temporary workaround is to comment out ‘pam_system.so’ in system-auth and system-login..

 307 PackagesBug ReportMediumLow [i486] make guile JIT failing Closed
100%
Task Description
*** work/functions/guile.base   Wed Nov 16 17:55:19 2022
--- work/functions/guile.log    Wed Nov 16 17:55:19 2022
***************
*** 1,3 ****
--- 1,7 ----
+ JIT failed to initialize
+ disabling automatic JIT compilation
+ JIT failed due to resource exhaustion
+ disabling automatic JIT compilation
 324 PackagesBug ReportMediumLow [libxft] segfaults Closed
100%
Task Description
Mar 08 19:16:01 arch32 audit[409]: ANOM_ABEND auid=1000 uid=0 gid=0 ses=5 pid=409 comm="slim" exe="/usr/bi                                                                                                          n/slim" sig=11 res=1                                                                                                                                                                                                
Mar 08 19:16:01 arch32 kernel: slim[409]: segfault at 30 ip b7dbe9e9 sp bf84f680 error 4 in libX11.so.6.4.                                                                                                          0[b7d9c000+8c000] likely on CPU 0 (core 0, socket 0)                                                                                                                                                                
Mar 08 19:16:01 arch32 kernel: Code: 04 00 00 83 c4 10 eb 8e 8d b4 26 00 00 00 00 66 90 53 e8 1a dd fd ff                                                                                                           81 c3 92 7a 11 00 83 ec 08 8b 44 24 10 8b 88 38 05 00 00 <8b> 51 30 83 fa ff 74 52 c7 41 30 ff ff ff ff 8b                                                                                                           88 d0 04 00 00 85                                                                                                                                                                  
Mar 08 19:16:01 arch32 systemd[1]: Started Process Core Dump (PID 424/UID 0).                                                                                                                                       
Mar 08 19:16:01 arch32 audit[1]: SERVICE_START pid=1 uid=0 auid=4294967295 ses=4294967295 msg='unit=system                                                                                                          d-coredump@1-424-0 comm="systemd" exe="/usr/lib/systemd/systemd" hostname=? addr=? terminal=? res=success'                                                                                                          
Mar 08 19:16:01 arch32 systemd-coredump[425]: [🡕] Process 409 (slim) of user 0 dumped core.                                                                                                                         
                                                                                                                                                                                                                    
                                              Stack trace of thread 409:                                                                                                                                            
                                              #0  0x00000000b7dbe9e9 _XAllocID (libX11.so.6 + 0x349e9)                                                                                                              
                                              #1  0x00000000b7d9f710 XCreatePixmap (libX11.so.6 + 0x15710)                                                                                                          
                                              #2  0x00000000b74cbd41 XRenderFindDisplay (libXrender.so.1 +                                                                                                           0x2d41)                                                                                                                                                                                                            
                                              #3  0x00000000b74cccf1 XRenderFreeGlyphSet (libXrender.so.1                                                                                                           + 0x3cf1)                                                                                                                                                                                                           
                                              #4  0x00000000b766e55b n/a (libXft.so.2 + 0x655b)                                                                                                                     
                                              #5  0x00000000b7c9a4fa _ZN5PanelD2Ev (libslim.so.1.3.6 + 0x1                                                                                                          34fa)                                                                                                                                                                                                               
                                              #6  0x00000000004bc49f _ZN3App13RestartServerEv (slim + 0xd4                                                                                                          9f)                                                                                                                                                                                                                 
                                              #7  0x00000000004bd623 _ZN3App5LoginEv (slim + 0xe623)                                                                                                                
                                              #8  0x00000000004bc073 _ZN3App3RunEv (slim + 0xd073)                                                                                                                  
                                              #9  0x00000000004b4742 main (slim + 0x5742)                                                                                                                           
                                              #10 0x00000000b7850129 n/a (libc.so.6 + 0x1f129)                                                                                                                      
                                              #11 0x00000000b78501fd __libc_start_main (libc.so.6 + 0x1f1f                                                                                                          d)                                                                                                                                                                                                                  
                                              #12 0x00000000004b48b5 _start (slim + 0x58b5)                                                                                                                         
                                              ELF object binary architecture: Intel 80386                                                                                                                           
 331 PackagesBug ReportMediumLow [rust] rebootstrap Closed
100%
Task Description

seems like the virtual memory exhaustion is fixed in the newest version.
We have to bootstrap again (mainly for librsvg and firefox).

 358 PackagesBug ReportMediumLow All versions of samba > 4.17.5 are broken Closed
100%
Task Description

Either because of ICU or LDB incompatibilites.
tdb, ldb, samba and python have to be rebuild.

 93 Packages: StableBug ReportVery LowMedium pyparsing error is preventing applications from startin ...Closed
100%
Task Description

Came across this after completing a system update two days ago.

I run Radicale and that is refusing to start with the following error:

Traceback (most recent call last):
  File "/usr/bin/radicale", line 6, in <module>
    from pkg_resources import load_entry_point
  File "/usr/lib/python3.7/site-packages/pkg_resources/__init__.py", line 84, in <module>
    __import__('packaging.requirements')
  File "/usr/lib/python3.7/site-packages/packaging/requirements.py", line 9, in <module>
    from pyparsing import stringStart, stringEnd, originalTextFor, ParseException
ModuleNotFoundError: No module named 'pyparsing'

When attempting to run pip to see if that might correct the issue, I got the following error:

Traceback (most recent call last):
  File "/usr/bin/pip", line 6, in <module>
    from pkg_resources import load_entry_point
  File "/usr/lib/python3.7/site-packages/pkg_resources/__init__.py", line 84, in <module>
    __import__('packaging.requirements')
  File "/usr/lib/python3.7/site-packages/packaging/requirements.py", line 9, in <module>
    from pyparsing import stringStart, stringEnd, originalTextFor, ParseException
ModuleNotFoundError: No module named 'pyparsing'

It looks as though something recently broke pyparsing and that’s had a knockon effect for a few packages.

 110 PackagesBug ReportVery LowLow [syslog-ng] is built without systemd support Closed
100%
Task Description

The packages for syslog-ng since version 3.27.1-1.0 appears to have been built without systemd support. Although their PKGBUILD runs configure with –enable-systemd, running syslog-ng –version shows Enable-Systemd: off. The official Arch x86_64 package (at version 3.28.1-1) doesn’t exhibit this problem.

I tried building the package locally on i686 using the official Arch PKGBUILD and could not reproduce the problem. My locally built version correctly finds libsystemd during configure, and gets built with systemd support. This leads me to believe the problem happens somewhere in the Archlinux32 build process.


The practical upshot of the problem is that the systemd unit file supplied with syslog-ng lists it as a Type=notify service, but when it fails to notify systemd after startup, systemd eventually kills it and restarts it repeatedly:

Jul 24 07:32:31 wolfie systemd[1]: Starting System Logger Daemon "default" instance...
Jul 24 07:32:32 wolfie syslog-ng[18977]: syslog-ng starting up; version='3.28.1'
Jul 24 07:34:01 wolfie systemd[1]: syslog-ng@default.service: start operation timed out. Terminating.
Jul 24 07:34:01 wolfie syslog-ng[18977]: syslog-ng shutting down; version='3.28.1'
Jul 24 07:34:01 wolfie systemd[1]: syslog-ng@default.service: Failed with result 'timeout'.
Jul 24 07:34:01 wolfie systemd[1]: Failed to start System Logger Daemon "default" instance.
Jul 24 07:34:02 wolfie systemd[1]: syslog-ng@default.service: Scheduled restart job, restart counter is at 1.
Jul 24 07:34:02 wolfie systemd[1]: Stopped System Logger Daemon "default" instance.
Jul 24 07:34:02 wolfie systemd[1]: Starting System Logger Daemon "default" instance...
 119 PackagesBug ReportVery LowHigh [gdb] needs rebuilt after python upgrade Closed
100%
Task Description

Pacman recently upgraded python from 3.8 to 3.9, which breaks the gdb package:

% gdb
gdb: error while loading shared libraries: libpython3.8.so.1.0: cannot open shared object file: No such file or directory
 121 PackagesBug ReportVery LowHigh Multiple packages need rebuild after libicu upgrade Closed
100%
Task Description

Over in  FS#119 , @abaumann mentioned that the libicu upgrade from 67 to 68 was part of what broke gdb. I missed the libicu upgrade when looking at gdb, but now that that one is resolved, I noticed a number of other packages that still link against the old and now nonexistant /usr/lib/libicu*.so.67 files. On my particular system, the following packages are installed, link to icu 67, and need rebuilt as well:

* harfbuzz-icu (2.7.0-1.0)
* mongo-c-driver (1.17.3-1.0)
* postfix (3.5.6-2.0)
* postgresql (12.4-1.0)
* postgresql-old-upgrade (12.5-1.0)
* samba (4.12.3-1.2)
* smbclient (4.12.3-1.2)
* syslog-ng (3.28.1-3.0)
* texlive-bin (2020.54586-4.0)
* xfsprogs (5.8.0-1.0)

… but I’m sure you have a way of determining all the affected packages?

As a workaround, in case others have the same problem, I manually extracted the old versioned .so files from the previous package to get things working again:

```
tar -C / -xf /var/cache/pacman/pkg/icu-67.1-1.0-i686.pkg.tar.zst –wildcards ‘usr/lib/lib*.so.*’ ```

- I’ll just have to remember to clean them up again later.

 122 PackagesBug ReportVery LowLow Permissions bits on files on the primary mirror are too ...Closed
100%
Task Description

In my quest to find a working mirror close to me, I’ve come across another issue with at least a couple of mirrors. Some mirrors respond with a HTTP 403 Forbidden for certain files, notably many of the Pacman database files. At the time of this writing, I’m aware of this problem happening with the princeton.edu and the clarkson.edu mirrors. I’ve been in contact with the admin of one of the mirrors, and they’ve pointed out that the permission bits are set to 0600 at the source. If the primary mirror could have their files be world readable, it would likely fix this problem automatically across more than one mirror.

Is that something we can do?

Steps to verify:

1. Access certain files from the primary mirror using rsync, for example:

% rsync -av rsync://mirror.archlinux32.org/archlinux32/i686/extra/extra.db.tar.gz .
receiving incremental file list
extra.db.tar.gz

sent 43 bytes  received 2,044,453 bytes  371,726.55 bytes/sec
total size is 2,043,851  speedup is 1.00

2. Examine permission bits:

% ls -l extra.db.tar.gz
-rw------- 1 user user 2043851 Jan  8 11:51 extra.db.tar.gz

Should be -rw-r–r–.

 179 Packages: StableBug ReportVery LowMedium Snapper needs rebuild from icu upgrade Closed
100%
Task Description

icu69.1-1.0 however snapper still links against libicuuc.so.68

Running snapper now gives the following error:

# snapper list /
snapper: error while loading shared libraries: libicuuc.so.68: cannot open shared object file: No such file or directory
 195 Packages: TestingBug ReportVery LowLow libreoffice-fresh and libreoffice-still will not start  Closed
100%
Task Description

There is a problem with libreoffice-fresh and libreoffice-still which appears to be caused by the last update to boost and boost-libs which are now at version 1.76.0-1.3

~]$ libreoffice
javaldx: Could not find a Java Runtime Environment!
Warning: failed to read path from javaldx
/usr/lib/libreoffice/program/soffice.bin: error while loading shared libraries: libboost_locale.so.1.75.0: cannot open shared object file: No such file or directory
 219 PackagesBug ReportVery LowLow [postgresql] and [postgresql-old-upgrade] links against ...Closed
100%
Task Description

After my most recent sysupgrade, postgresql refuses to start. The main postgres binary appears to be linked to multiple versions of libicu:

$  ldd /usr/bin/postgres | grep icu
	libicui18n.so.69 => /usr/lib/libicui18n.so.69 (0xb6c00000)
	libicuuc.so.69 => /usr/lib/libicuuc.so.69 (0xb6a0c000)
	libicuuc.so.70 => /usr/lib/libicuuc.so.70 (0xb6582000)
	libicudata.so.69 => /usr/lib/libicudata.so.69 (0xb4601000)
	libicudata.so.70 => /usr/lib/libicudata.so.70 

(0xb27a4000)

Installing the icu69 compatibility package made it work again, but it doesn’t look right that it should link against multiple versions.

 232 PackagesBug ReportVery LowLow clementine fails on missing libprotobuf.so.27 Closed
100%
Task Description

After just having updated my trusty EeePC 1000H to be fully up to date again, I discovered that clementine is no longer working. It fails, stating that libprotobuf.so.27 cannot be found. Looking in /usr/lib, I can see libprotobuf.so.28, so I assume that the clementine package needs a rebuild.

 233 PackagesBug ReportVery LowLow Cannot install smplayer due to broken dependency Closed
100%
Task Description

I am currently unable to install smplayer in testing due to a broken dependency of mpv

[~]$ sudo pacman -S smplayer
resolving dependencies...
warning: cannot resolve "libplacebo.so=120-32", a dependency of "mpv"
warning: cannot resolve "mpv", a dependency of "smplayer"
:: The following package cannot be upgraded due to unresolvable dependencies:
      smplayer

:: Do you want to skip the above package for this upgrade? [y/N] y
looking for conflicting packages...
 there is nothing to do
 237 PackagesBug ReportVery LowLow i686: pango need to be rebuilt against harfbuzz Closed
100%
Task Description

Hi,

pango-list (and many packages depending on pango) fails to run with the following error:

$ pango-list 
pango-list: symbol lookup error: /usr/lib/libpangoft2-1.0.so.0: undefined symbol: hb_font_set_synthetic_slant

hb_font_set_synthetic_slant seems to be related to harfbuzz.

While I used Parabola i686 for the test, both pango and harfbuzz come from Arch Linux 32 i686, so Arch Linux 32 i686 should also be affected:

$ pacman -Q -o pango-list 
/usr/bin/pango-list is owned by pango 1:1.50.4-1.0
$ pacman -sS "^pango$"
extra/pango 1:1.50.4-1.0 [installed]
    A library for layout and rendering of text
$ pacman -sS "^harfbuzz$"
extra/harfbuzz 3.1.2-1.0 [installed]
    OpenType text shaping engine

Denis.

 238 PackagesBug ReportVery LowLow Linux-zen kernel 5.16.8.arch1-1.0 made with gcc 11.1 an ...Closed
100%
Task Description

Linux and Linux-zen kernel 5.16.8.arch1-1.0 made with gcc 11.1 and cannot build dkms modules with gcc 11.2

remake linux and linux-zen kernel with gcc version 11.2

 241 PackagesBug ReportVery LowLow mpd probably needs to be rebuilt against pipewire Closed
100%
Task Description

Hi,

If I run mpd, it fails to run due to a missing PW_LOG_TOPIC_DEFAULT symbol:
> $ mpd
> mpd: symbol lookup error: mpd: undefined symbol: PW_LOG_TOPIC_DEFAULT

While I run Parabola, both mpd and pipewire comes from the i686 repository of Arch Linux 32:
> extra/mpd 0.23.5-1.2 [installed]
> Flexible, powerful, server-side application for playing music
> extra/pipewire 1:0.3.36-1.0 [installed]
> Low-latency audio/video router and processor

If I look on a x86_64 Parabola installation instead, PW_LOG_TOPIC_DEFAULT can be found in libpipewire:
> $ readelf -s /usr/lib/libpipewire-0.3.so.0 | grep PW_LOG_
> 383: 00000000000d7128 8 OBJECT GLOBAL DEFAULT 21 > PW_LOG_TOPIC_DEFAULT

But that command returns nothing on Parabola i686.

Denis.

 244 PackagesBug ReportVery LowLow unable to satisfy dependency 'libx264.so=163-32' requir ...Closed
100%
Task Description

# pacman -Sy ffmpeg
:: Synchronizing package databases… core is up to date
extra is up to date
community is up to date
resolving dependencies… warning: cannot resolve “libx264.so=163-32”, a dependency of “ffmpeg” :: The following package cannot be upgraded due to unresolvable dependencies:

    ffmpeg
 251 Packages: StableBug ReportVery LowLow [pavucontrol] libcanberra/libcanberra-pulse dependency  ...Closed
100%
Task Description

There is currently a problem preventing the installation of pavucontrol on i686:

resolving dependencies...
warning: cannot resolve "libcanberra=0.30+2+gc0620e4-3.2", a dependency of "libcanberra-pulse"
warning: cannot resolve "libcanberra-pulse", a dependency of "pavucontrol"
:: The following package cannot be upgraded due to unresolvable dependencies:
      pavucontrol
error: failed to prepare transaction (could not satisfy dependencies)
:: unable to satisfy dependency 'libcanberra=0.30+2+gc0620e4-3.2' required by libcanberra-pulse
:: unable to satisfy dependency 'libcanberra-pulse' required by pavucontrol
 259 PackagesBug ReportVery LowLow Broken GSL package Closed
100%
Task Description

GSL broken dependence with inkscape:

$ inkscape
inkscape: error while loading shared libraries: libgsl.so.27: cannot open shared object file: No such file or directory

Check the library:

# pacman -Ss gsl
extra/gsl 2.7-1.0 [instalado]

# pacman -Ql gsl | grep ‘\.so’ gsl /usr/lib/libgsl.so
gsl /usr/lib/libgsl.so.25
gsl /usr/lib/libgsl.so.25.1.0
gsl /usr/lib/libgslcblas.so
gsl /usr/lib/libgslcblas.so.0
gsl /usr/lib/libgslcblas.so.0.0.0

 267 PackagesBug ReportVery LowLow [(g)vim] libperl.so dependency version mismatch Closed
100%
Task Description

`/bin/vim` in version 8.2.5046-2.0 has an rpath on `libperl.so` version 5.36, which is currently only available in staging (i686/core is at version 5.34). vim does not start (cannot open shared object file).

```
$ readelf -d /bin/vim

Dynamic section at offset 0×486090 contains 43 entries:

Tag        Type                         Name/Value

[…]
0x000000000000000f (RPATH) Library rpath: [/usr/lib/perl5/5.36/core_perl/CORE]
```

 273 Packages: StableBug ReportVery LowMedium Quazip Qt5 package contains Qt6 libraries Closed
100%
Task Description

The quazip-qt5 package for both i686 and pentium4 contains the Qt6 libraries instead of the Qt5 ones.

The quazip package also no longer seems to exist upstream and should probably be removed in Arch32 as well.

 274 PackagesBug ReportVery LowMedium perl-term-readline-gnu should be rebuilt due to new per ...Closed
100%
Task Description

When you have system update there is this warning:

Warn about old perl modules
WARNING: '/usr/lib/perl5/5.34' contains data from at least 1 packages which will NOT be used by the installed perl interpreter.
 -> Run the following command to get a list of affected packages: pacman -Qqo '/usr/lib/perl5/5.34'

After searching you see it’s caused by

$ pacman -Qqo '/usr/lib/perl5/5.34'
perl-term-readline-gnu

So this package should be rebulded, because in repositories is perl 5.36

More info and problem description https://forum.manjaro.pl/t/archlinux32-ostrzezenie-od-perl/2356

 279 Packages: StableBug ReportVery LowMedium Telegram Desktop doesn't start Closed
100%
Task Description

Telegram Desktop fails to start with an error about incompatible Qt libraries, I think it needs to be rebuilt.

 281 Packages: Build-listBug ReportVery LowLow Firefox compilation Closed
100%
Task Description

I checked the firefox on the build-list and its not compiling because of missing lvm13 libs which are packages are llvm13-libs and llvm13

 297 PackagesBug ReportVery LowLow jack2 can not install Closed
100%
Task Description
# pacman -S jack --noconfirm
:: There are 2 providers available for jack:
:: Repository extra
   1) jack2  2) pipewire-jack

Enter a number (default=1): 
resolving dependencies...
warning: cannot resolve "libcelt0.so=2-32", a dependency of "jack2"
:: The following package cannot be upgraded due to unresolvable dependencies:
      jack2

:: Do you want to skip the above package for this upgrade? [y/N] error: failed to prepare transaction (could not satisfy dependencies)

:: unable to satisfy dependency 'libcelt0.so=2-32' required by jack2
 303 PackagesBug ReportVery LowLow codeblocks issue.. Closed
100%
Task Description

its requested that please push the codeblocks testing to stable..

 305 Packages: StableBug ReportVery LowMedium [chezmoi] i686 and i486 packages are way out of date, p ...Closed
100%
Task Description

I did not see a way to report a package outdated (unlike upstream arch linux) so here is a bug report.

chezmoi (a dot file manager for your home directory) is way outdated in arch32, especially the non-pentium4 versions. This makes it unusable for me as my config depends on newer features.

I would at least expect arch32 to have the same version for i686 and pentium4.

 308 PackagesBug ReportVery LowLow gettext needs a rebuild for libunistring Closed
100%
Task Description

I’m on pentium4 and I’m getting:

/usr/bin/xgettext: error while loading shared libraries: libunistring.so.2: cannot open shared object file: No such file or directory
/usr/bin/msgmerge: error while loading shared libraries: libunistring.so.2: cannot open shared object file: No such file or directory
/usr/bin/msgfmt: error while loading shared libraries: libunistring.so.2: cannot open shared object file: No such file or directory

gettext 0.21.1-1.1
libunistring 1.1-2.0

 309 PackagesBug ReportVery LowLow gcompris links to openssl-1.1.so Closed
100%
Task Description

```
gcompris-qt: error while loading shared libraries: libssl.so.1.1: cannot open shared object file: No such file or directory
```

 312 PackagesBug ReportVery LowLow In testing calibre will not start Closed
100%
Task Description
[keith@Arch32 ~]$ calibre
Failed to import PyQt module: PyQt6.QtQuick with error: No module named 'PyQt6.QtQuick'
Traceback (most recent call last):
  File "/usr/bin/calibre", line 21, in <module>
    sys.exit(calibre())
  File "/usr/lib/calibre/calibre/gui_launch.py", line 73, in calibre
    main(args)
  File "/usr/lib/calibre/calibre/gui2/main.py", line 546, in main
    app, opts, args = init_qt(args)
  File "/usr/lib/calibre/calibre/gui2/main.py", line 123, in init_qt
    app = Application(args, override_program_name=override, windows_app_uid=MAIN_APP_UID)
  File "/usr/lib/calibre/calibre/gui2/__init__.py", line 1096, in __init__
    setup_to_run_webengine()
  File "/usr/lib/calibre/calibre/gui2/__init__.py", line 1078, in setup_to_run_webengine
    from qt.core import QQuickWindow, QSGRendererInterface
ImportError: cannot import name 'QQuickWindow' from 'qt.core' (/usr/lib/calibre/qt/core.py)
[keith@Arch32 ~]$ calibre --version
calibre (calibre 6.7.1)
[keith@Arch32 ~]$ 
 317 PackagesBug ReportVery LowMedium [pacutils] paccheck core dumps Closed
100%
Task Description

$ paccheck pacman
pacman: all dependencies satisfied
zsh: segmentation fault (core dumped) paccheck pacman

It seems to be in the –files check (as with that the crash happens quicker).

Debuginfod doesn’t seem to work for ArchLinux32 (unlike standard ArchLinux) so no debug symbols, but here is the gdb backtrace:

(gdb) bt
#0 0xb7d1989a in strnlen () from /usr/lib/libc.so.6
#1 0xb7d197ac in strncpy () from /usr/lib/libc.so.6
#2 0x00402abe in ?? ()
#3 0x0040244a in ?? ()
#4 0xb7c96129 in ?? () from /usr/lib/libc.so.6
#5 0xb7c961fd in __libc_start_main () from /usr/lib/libc.so.6
#6 0x004026f5 in ?? ()

Valgrind does not seem to work properly on Arch32 either, so I can’t test that.

 318 PackagesBug ReportVery LowLow [multiple]: Note: This key has expired! Closed
100%
Task Description
$ wget http://pool.mirror.archlinux32.org/i686/core/binutils-2.40-2.0-i686.pkg.tar.zst
$ wget http://pool.mirror.archlinux32.org/i686/core/binutils-2.40-2.0-i686.pkg.tar.zst.sig
$ sudo pacman-key --verify binutils-2.40-2.0-i686.pkg.tar.zst.sig
==> Checking binutils-2.40-2.0-i686.pkg.tar.zst.sig... (detached)
gpg: Signature made Mon Jan 23 01:17:18 2023 EST
gpg:                using RSA key 16194A82231E9EF823562181C8E8F5A0AF9BA7E7
gpg: Good signature from "Andreas Baumann (sign) <mail@andreasbaumann.cc>" [expired]
gpg: Note: This key has expired!
Primary key fingerprint: 1619 4A82 231E 9EF8 2356  2181 C8E8 F5A0 AF9B A7E7
==> ERROR: The signature identified by binutils-2.40-2.0-i686.pkg.tar.zst.sig could not be verified.

<KitsuWhooa> fuse also fails for me

 323 PackagesBug ReportVery LowMedium qemu-desktop installation error Closed
100%
Task Description

While installing qemu-desktop for Archlinux32 following error appears:

/usr/bin/gtk-query-immodules-3.0: symbol lookup error: /usr/liblibpango-1.0.so.0: undefined symbol: hb_ot_color_has_paint

Pango version pango-1:1.50.14-1.0-pentium4. This is a problem of Archlinux32 only - in Archlinux there is no error.

 329 PackagesBug ReportVery LowHigh [go] Cannot install yay from AUR Closed
100%
Task Description

Installing yay from AUR

git clone https://aur.archlinux.org/yay.git
cd yay
makepkg -sri

gives following error

go: updates to go.sum needed, disabled by -mod=readonly

Reason - outdated version of go in i686 architecture

Temporary solution - use go for pentium4 (change temporarily architecture to pentium4 in /etc/pacman.conf)

Showing tasks 101 - 150 of 350 Page 3 of 7 - 1 - 2 - 3 - 4 - 5 - Last >>

Available keyboard shortcuts

Tasklist

Task Details

Task Editing