Bugs in Archlinux32 packages, specific to 32-bit issues.

Bugs  FS#2  to  FS#92  have been recovered and may be incomplete, the
recovered Google/Bing cache data can be found here.

IDCategoryTask TypePrioritySeveritySummaryStatus  descProgress
 263 PackagesBug ReportMediumLow [libnss_systemd] segfault on login Closed
100%
Task Description

Experienced with mate and xfce, logging in results in:

md-coredump@1-384-0 comm="systemd" exe="/usr/lib/systemd/systemd" hostname=? addr=? terminal=? res=success'
May 15 12:33:34 arch32 kernel: audit: type=1130 audit(1652610814.953:50): pid=1 uid=0 auid=4294967295 ses=4294967295 msg='unit=systemd-coredump@1-384-0 comm="systemd" exe="/usr/lib/systemd/systemd" hostname=? addr=? terminal=? res=success'
May 15 12:33:35 arch32 systemd-coredump[385]: Process 345 (lightdm) of user 0 dumped core.
                                              
                                              Module linux-gate.so.1 with build-id a27879231a619f481c5f61675aaa832fd638cb59
                                              Module libnss_systemd.so.2 with build-id 513870f67a61f7ea3d6e57c8f95f354de951706d
                                              Module pam_warn.so with build-id c2d0d3d8af8a67a71b5f2c65b5c1bbd307215915
                                              Module pam_deny.so with build-id 3f3db5fc2f00b0311c1055abff87446bd21ed382
                                              Module libpam_misc.so.0 with build-id f9b9c0b45bff4398cfb8af0d4ab66e20e862490a
                                              Module pam_systemd.so with build-id 7e789653df9c1d629075ca9e56b924a39ab8f30a
                                              Module pam_mail.so with build-id 113680c35df7dd7d41f77b00b004c201c4f19a09
                                              Module pam_motd.so with build-id ac0c4aa42752e17cbd95f6625873d3e84dffbabd
                                              Module pam_limits.so with build-id a229b08f2ae095fec0f9b9fcc08a9851501a47f3
                                              Module pam_keyinit.so with build-id bc58e8776715407d61b32b6d8d4bf4e7317dd98c
                                              Module pam_loginuid.so with build-id 41a858e6a28f79da7ff5800bc27195119be5626a
                                              Module pam_time.so with build-id 703a26cf2e5c055cc07ddf7f323e0eefbb84ec8a
                                              Module pam_access.so with build-id 55b6fed1bfe3f208cb32ee028c2ff06025ab3a45
                                              Module pam_env.so with build-id 055f29545a53ec4d2443001c1e03c75320988013
                                              Module pam_permit.so with build-id ebe5828bc48cb18e3dd029a2240cebb57e14f768
                                              Module libkeyutils.so.1 with build-id 5a50265493bf37e60323c71fb776cfd730bf8964
                                              Module libkrb5support.so.0 with build-id 716c0f85b8408ce69093706649d5ebaae25456b0
                                              Module libcom_err.so.2 with build-id 60116fbed67a6c3ab90da2f38c550bc1d1f79f02
                                              Module libk5crypto.so.3 with build-id 3459692a8e859eec416dcfce08e9fe69a4f1311f
                                              Module libkrb5.so.3 with build-id 5400284945ac88bb9fa911a9b987a34ed2274010
                                              Module libgssapi_krb5.so.2 with build-id 546b080b472317aeb2f04b396935e03e2bd78911
                                              Module libtirpc.so.3 with build-id 5034a25480814d17e335ca016d0299fdbdc0cae9
                                              Module pam_unix.so with build-id 3d7111b8433120fb2793be17510462b7db176197
                                              Module libp11-kit.so.0 with build-id ee4f39a2bf217877ed8f65eee72b1af45a3bf1a2
                                              Module libcrypto.so.1.1 with build-id 9f5d5eddb3c55325af7d4241cbe597a48a5b999c
                                              Module libm.so.6 with build-id 9039ae10a04fcb30d921fd5c76097c7a3f665370
                                              Module libcap.so.2 with build-id 4d323ab3b69bef5921d049778199ca62a9c7811c
                                              Module libcrypt.so.2 with build-id a66b381fec2654ed68c0491bd86e896e8d190597
                                              Module pam_systemd_home.so with build-id 4331342dd5ed0b492d732501e4dc3fa9f1bd598a
                                              Module pam_faillock.so with build-id f8f59c3134d8d7d9a3b271ff3f81f77fb8b973a2
                                              Module pam_nologin.so with build-id 64f5509dbde1de344f52af9b73711769affbe840
                                              Module pam_shells.so with build-id 24a1716196a601444b2dd1866ce46de7973ef27b
                                              Module librt.so.1 with build-id fa61d1f12a409640b8cf40cf9a23b352f1bc0552
                                              Module libblkid.so.1 with build-id 5d2cf9b1a4781b9178b53d80028a93380d91520a
                                              Module ld-linux.so.2 with build-id 595ad200cc586e2697315fb53e2d0eb7b1b9c1c1
                                              Module libdl.so.2 with build-id 1d3a3521b2e6abc69c970335373065339a553791
                                              Module libgpg-error.so.0 with build-id ad225378bc723ed6b4b8b15099198fbedfcacd08
                                              Module libcap-ng.so.0 with build-id ee0d4a32f9f1173f386abc7d685ef18dd5c29061
                                              Module libXau.so.6 with build-id ca0c911ec4ccee4b60d41ce4d8cadb6303faa158
                                              Module libpcre.so.1 with build-id 9e8433d78efdfe75dc9ca017f477cf938d804df1
                                              Module libffi.so.8 with build-id 691b36b35ab1c4821e3e97a70d774dcd69133fdc
                                              Module libresolv.so.2 with build-id f9d6b273df20a9704fc122ac781527a783638301
                                              Module libmount.so.1 with build-id 1acb539ab365dd2f5b20907ad40da36b8e9fe264
                                              Module libz.so.1 with build-id bed5219c83b00026030d38c8912fc2d9cfd33851
                                              Module libgmodule-2.0.so.0 with build-id 8f6ff76c08d4ff9075c35915c959a867bfe58cf6
                                              Module libc.so.6 with build-id 17751704b417b7760f84338ea777fd67fae6ef96
                                              Module libpthread.so.0 with build-id e41f23d77ed9ff0c67d4d63e3e272b50cd81e3cc
                                              Module libpam.so.0 with build-id 01ddafaed94ed4dbbc9126943929915326d00290
                                              Module libgcrypt.so.20 with build-id 1f9f583f3f53e6556867735a4c2f9686e19067e0
                                              Module libaudit.so.1 with build-id 1ef22adc0a368bafd37e88808dc4fe06e1d04198
                                              Module libxcb.so.1 with build-id 350f0b983356df7c00c3edfd69e60869a3074671
                                              Module libXdmcp.so.6 with build-id d3227d8950007ff94ae016a81373b7e920eb8926
                                              Module libglib-2.0.so.0 with build-id 3057954359bdc8d2b6a0e220a8a4d5e13c134cb8
                                              Module libgobject-2.0.so.0 with build-id 63a1e70bd9f4e113f1dcd15ccd533ea00ee7e67b
                                              Module libgio-2.0.so.0 with build-id f8a91d2df4aa66c093de256c755782ef7d42850c
                                              Module lightdm with build-id 3892c6848f55843ad693ca2f1997ceb91354e9d4
                                              Stack trace of thread 345:

 259 PackagesBug ReportVery LowLow Broken GSL package Closed
100%
Task Description

GSL broken dependence with inkscape:

$ inkscape
inkscape: error while loading shared libraries: libgsl.so.27: cannot open shared object file: No such file or directory

Check the library:

# pacman -Ss gsl
extra/gsl 2.7-1.0 [instalado]

# pacman -Ql gsl | grep ‘\.so’ gsl /usr/lib/libgsl.so
gsl /usr/lib/libgsl.so.25
gsl /usr/lib/libgsl.so.25.1.0
gsl /usr/lib/libgslcblas.so
gsl /usr/lib/libgslcblas.so.0
gsl /usr/lib/libgslcblas.so.0.0.0

 256 PackagesBug ReportMediumLow [ISO] fails to boot, mount value too large error Closed
100%
Task Description
/init: line 477: mount: Value too large for defined data type

At least ISO 2022.04.03 is affected..

 253 PackagesBug ReportMediumLow [rust] rebuilds but fails to build anything Closed
100%
Task Description

Bootstrapping rust via rust159-bin leads to:

error[E0463]: can't find crate for `std`

error[E0463]: can't find crate for `core`

error[E0463]: can't find crate for `compiler_builtins`

Basically, rust is broken.

 251 Packages: StableBug ReportVery LowLow [pavucontrol] libcanberra/libcanberra-pulse dependency  ...Closed
100%
Task Description

There is currently a problem preventing the installation of pavucontrol on i686:

resolving dependencies...
warning: cannot resolve "libcanberra=0.30+2+gc0620e4-3.2", a dependency of "libcanberra-pulse"
warning: cannot resolve "libcanberra-pulse", a dependency of "pavucontrol"
:: The following package cannot be upgraded due to unresolvable dependencies:
      pavucontrol
error: failed to prepare transaction (could not satisfy dependencies)
:: unable to satisfy dependency 'libcanberra=0.30+2+gc0620e4-3.2' required by libcanberra-pulse
:: unable to satisfy dependency 'libcanberra-pulse' required by pavucontrol
 244 PackagesBug ReportVery LowLow unable to satisfy dependency 'libx264.so=163-32' requir ...Closed
100%
Task Description

# pacman -Sy ffmpeg
:: Synchronizing package databases… core is up to date
extra is up to date
community is up to date
resolving dependencies… warning: cannot resolve “libx264.so=163-32”, a dependency of “ffmpeg” :: The following package cannot be upgraded due to unresolvable dependencies:

    ffmpeg
 242 PackagesBug ReportMediumLow [flac] fails to build Closed
100%
Task Description

This is just the sad state of what people do to working software:

if(CMAKE_SYSTEM_PROCESSOR STREQUAL "i686" AND HAVE_STACKREALIGN_FLAG)
    add_compile_options(-mstackrealign)
endif()

which results in nasm to fail with “unknown option -m”

a) they rewrite half of the build system without apparently understanding fully the autoconf part
b) they don’t bother to delete to autoconf part
c) they write code for porting the software apparenty without testing (why bother then in the first place?)

 241 PackagesBug ReportVery LowLow mpd probably needs to be rebuilt against pipewire Closed
100%
Task Description

Hi,

If I run mpd, it fails to run due to a missing PW_LOG_TOPIC_DEFAULT symbol:
> $ mpd
> mpd: symbol lookup error: mpd: undefined symbol: PW_LOG_TOPIC_DEFAULT

While I run Parabola, both mpd and pipewire comes from the i686 repository of Arch Linux 32:
> extra/mpd 0.23.5-1.2 [installed]
> Flexible, powerful, server-side application for playing music
> extra/pipewire 1:0.3.36-1.0 [installed]
> Low-latency audio/video router and processor

If I look on a x86_64 Parabola installation instead, PW_LOG_TOPIC_DEFAULT can be found in libpipewire:
> $ readelf -s /usr/lib/libpipewire-0.3.so.0 | grep PW_LOG_
> 383: 00000000000d7128 8 OBJECT GLOBAL DEFAULT 21 > PW_LOG_TOPIC_DEFAULT

But that command returns nothing on Parabola i686.

Denis.

 239 PackagesBug ReportMediumLow [ffmpeg] and [ffmepg4.4] fail to build Closed
100%
Task Description
libswscale/x86/rgb2rgb_template.c: In function ‘interleaveBytes_sse2’:
libswscale/x86/rgb2rgb_template.c:1838:9: error: the register ‘xmm2’ cannot be clobbered in ‘asm’ for the current target
 1838 |         __asm__(
      |         ^

Also on i486 symbols are missing if not using LTO and probing of libraries like x264/x265 fail.

 238 PackagesBug ReportVery LowLow Linux-zen kernel 5.16.8.arch1-1.0 made with gcc 11.1 an ...Closed
100%
Task Description

Linux and Linux-zen kernel 5.16.8.arch1-1.0 made with gcc 11.1 and cannot build dkms modules with gcc 11.2

remake linux and linux-zen kernel with gcc version 11.2

 237 PackagesBug ReportVery LowLow i686: pango need to be rebuilt against harfbuzz Closed
100%
Task Description

Hi,

pango-list (and many packages depending on pango) fails to run with the following error:

$ pango-list 
pango-list: symbol lookup error: /usr/lib/libpangoft2-1.0.so.0: undefined symbol: hb_font_set_synthetic_slant

hb_font_set_synthetic_slant seems to be related to harfbuzz.

While I used Parabola i686 for the test, both pango and harfbuzz come from Arch Linux 32 i686, so Arch Linux 32 i686 should also be affected:

$ pacman -Q -o pango-list 
/usr/bin/pango-list is owned by pango 1:1.50.4-1.0
$ pacman -sS "^pango$"
extra/pango 1:1.50.4-1.0 [installed]
    A library for layout and rendering of text
$ pacman -sS "^harfbuzz$"
extra/harfbuzz 3.1.2-1.0 [installed]
    OpenType text shaping engine

Denis.

 233 PackagesBug ReportVery LowLow Cannot install smplayer due to broken dependency Closed
100%
Task Description

I am currently unable to install smplayer in testing due to a broken dependency of mpv

[~]$ sudo pacman -S smplayer
resolving dependencies...
warning: cannot resolve "libplacebo.so=120-32", a dependency of "mpv"
warning: cannot resolve "mpv", a dependency of "smplayer"
:: The following package cannot be upgraded due to unresolvable dependencies:
      smplayer

:: Do you want to skip the above package for this upgrade? [y/N] y
looking for conflicting packages...
 there is nothing to do
 232 PackagesBug ReportVery LowLow clementine fails on missing libprotobuf.so.27 Closed
100%
Task Description

After just having updated my trusty EeePC 1000H to be fully up to date again, I discovered that clementine is no longer working. It fails, stating that libprotobuf.so.27 cannot be found. Looking in /usr/lib, I can see libprotobuf.so.28, so I assume that the clementine package needs a rebuild.

 227 PackagesBug ReportMediumLow [object-introspection] [libosinfo] rebuild issue Closed
100%
Task Description

affects: tracker-miners tracker3-miners gnome-documents gnome-music gnome-photos nautilus

 225 PackagesBug ReportHighCritical [zstd] 1.5.1, zstd compressed ramdisk fails to load pro ...Closed
100%
Task Description

kernel issue with some network card and/or
systemd subservice not working add all

I cannot login remotely or locally.

System drops to maintainance shell..

Not a single systemd subdaemon is working..

This also effectively kills all i486 build machines..

 220 PackagesBug ReportVery HighCritical [python] completly broken Closed
100%
Task Description

Traceback (most recent call last):

File "/usr/lib/python3.9/site-packages/mercurial/policy.py", line 69, in _importfrom
  fakelocals[modname] = mod = getattr(pkg, modname)
File "/usr/lib/python3.9/site-packages/mercurial/pycompat.py", line 307, in w
  return f(object, sysstr(name), *args)

AttributeError: module ‘mercurial.cext’ has no attribute ‘parsers’

During handling of the above exception, another exception occurred:

Traceback (most recent call last):

File "/usr/bin/hg", line 61, in <module>
  dispatch.run()
File "/usr/lib/python3.10/importlib/util.py", line 247, in __getattribute__
  self.__spec__.loader.exec_module(self)
File "<frozen importlib._bootstrap_external>", line 883, in exec_module
File "<frozen importlib._bootstrap>", line 241, in _call_with_frames_removed
File "/usr/lib/python3.9/site-packages/mercurial/dispatch.py", line 21, in <module>
  from .i18n import _
File "/usr/lib/python3.10/importlib/util.py", line 247, in __getattribute__
  self.__spec__.loader.exec_module(self)
File "/usr/lib/python3.9/site-packages/mercurial/i18n.py", line 123, in <module>
  if _plain():
File "/usr/lib/python3.9/site-packages/mercurial/i18n.py", line 115, in _plain
  b'HGPLAIN' not in encoding.environ
File "/usr/lib/python3.10/importlib/util.py", line 247, in __getattribute__
  self.__spec__.loader.exec_module(self)
File "/usr/lib/python3.9/site-packages/mercurial/encoding.py", line 41, in <module>
  charencode = policy.importmod('charencode')
File "/usr/lib/python3.9/site-packages/mercurial/policy.py", line 116, in importmod
  mod = _importfrom(pn, mn)
File "/usr/lib/python3.9/site-packages/mercurial/policy.py", line 71, in _importfrom
  raise ImportError('cannot import name %s' % modname)

ImportError: cannot import name parsers

for instance when building nss.

 219 PackagesBug ReportVery LowLow [postgresql] and [postgresql-old-upgrade] links against ...Closed
100%
Task Description

After my most recent sysupgrade, postgresql refuses to start. The main postgres binary appears to be linked to multiple versions of libicu:

$  ldd /usr/bin/postgres | grep icu
	libicui18n.so.69 => /usr/lib/libicui18n.so.69 (0xb6c00000)
	libicuuc.so.69 => /usr/lib/libicuuc.so.69 (0xb6a0c000)
	libicuuc.so.70 => /usr/lib/libicuuc.so.70 (0xb6582000)
	libicudata.so.69 => /usr/lib/libicudata.so.69 (0xb4601000)
	libicudata.so.70 => /usr/lib/libicudata.so.70 

(0xb27a4000)

Installing the icu69 compatibility package made it work again, but it doesn’t look right that it should link against multiple versions.

 217 PackagesBug ReportMediumLow [llvm12] shim needed Closed
100%
Task Description

librsvg/rust fails because llvm is now 13 and we don’t have the llvm12-libs around anymore.
Will make a shim package.

 215 PackagesBug ReportMediumLow firefox 93.0 (and seamonkey 2.53.9.1) doesn't build Closed
100%
Task Description
 2:52.15 error: `[u32; 2]` is forbidden as the type of a const generic parameter
 2:52.15   --> /build/firefox/src/firefox-93.0/third_party/rust/packed_simd/src/codegen/llvm.rs:20:44
 2:52.15    |
 2:52.15 20 | pub unsafe fn __shuffle_vector2<const IDX: [u32; 2], T, U>(x: T, y: T) -> U
 2:52.15    |                                            ^^^^^^^^
 2:52.15    |
 2:52.15    = note: the only supported types are integers, `bool` and `char`
 2:52.15    = help: more complex types are supported with `#![feature(adt_const_params)]`
 2:52.15 error: `[u32; 4]` is forbidden as the type of a const generic parameter
 2:52.15   --> /build/firefox/src/firefox-93.0/third_party/rust/packed_simd/src/codegen/llvm.rs:30:44
 2:52.15    |
 2:52.15 30 | pub unsafe fn __shuffle_vector4<const IDX: [u32; 4], T, U>(x: T, y: T) -> U
 2:52.15    |                                            ^^^^^^^^
 2:52.15    |
 2:52.15    = note: the only supported types are integers, `bool` and `char`
 2:52.15    = help: more complex types are supported with `#![feature(adt_const_params)]`
 2:52.15 error: `[u32; 8]` is forbidden as the type of a const generic parameter
 2:52.15   --> /build/firefox/src/firefox-93.0/third_party/rust/packed_simd/src/codegen/llvm.rs:40:44
 2:52.15    |
 2:52.15 40 | pub unsafe fn __shuffle_vector8<const IDX: [u32; 8], T, U>(x: T, y: T) -> U
 2:52.15    |                                            ^^^^^^^^
 2:52.15    |
 2:52.15    = note: the only supported types are integers, `bool` and `char`
 2:52.15    = help: more complex types are supported with `#![feature(adt_const_params)]`
 2:52.15 error: `[u32; 16]` is forbidden as the type of a const generic parameter
 2:52.15   --> /build/firefox/src/firefox-93.0/third_party/rust/packed_simd/src/codegen/llvm.rs:50:45
 2:52.15    |
 2:52.15 50 | pub unsafe fn __shuffle_vector16<const IDX: [u32; 16], T, U>(x: T, y: T) -> U
 2:52.15    |                                             ^^^^^^^^^
 2:52.15    |
 2:52.15    = note: the only supported types are integers, `bool` and `char`
 2:52.15    = help: more complex types are supported with `#![feature(adt_const_params)]`
 2:52.15 error: `[u32; 32]` is forbidden as the type of a const generic parameter
 2:52.15   --> /build/firefox/src/firefox-93.0/third_party/rust/packed_simd/src/codegen/llvm.rs:60:45
 2:52.15    |
 2:52.15 60 | pub unsafe fn __shuffle_vector32<const IDX: [u32; 32], T, U>(x: T, y: T) -> U
 2:52.15    |                                             ^^^^^^^^^
 2:52.15    |
 2:52.15    = note: the only supported types are integers, `bool` and `char`
 2:52.15    = help: more complex types are supported with `#![feature(adt_const_params)]`
 2:52.15 error: `[u32; 64]` is forbidden as the type of a const generic parameter
 2:52.15   --> /build/firefox/src/firefox-93.0/third_party/rust/packed_simd/src/codegen/llvm.rs:70:45
 2:52.15    |
 2:52.15 70 | pub unsafe fn __shuffle_vector64<const IDX: [u32; 64], T, U>(x: T, y: T) -> U
 2:52.15    |                                             ^^^^^^^^^
 2:52.15    |
 2:52.15    = note: the only supported types are integers, `bool` and `char`
 2:52.15    = help: more complex types are supported with `#![feature(adt_const_params)]`
 2:52.35    Compiling num_cpus v1.13.0
 2:53.13    Compiling fluent-langneg v0.13.0
 2:53.15    Compiling intl_pluralrules v7.0.1
 2:53.59    Compiling intl-memoizer v0.5.1
 2:55.32    Compiling gl_generator v0.14.0
 2:55.37    Compiling cose-c v0.1.5
 2:55.96    Compiling time v0.1.43
 2:56.01    Compiling iovec v0.1.4
 2:56.05    Compiling atty v0.2.14
 2:56.21 For more information about this error, try `rustc --explain E0557`.
 2:56.23    Compiling net2 v0.2.37
 2:56.24 The following warnings were emitted during compilation:
 2:56.25 warning: Cannot set `RUSTC_BOOTSTRAP=1` from build script of `packed_simd v0.3.4 (https://github.com/hsivonen/packed_simd?rev=6a16f954950401b92b4e220fbf2dfaf6f00e1fb2#6a16f954)`.
 2:56.25 note: Crates cannot set `RUSTC_BOOTSTRAP` themselves, as doing so would subvert the stability guarantees of Rust for your project.
 2:56.25 error: could not compile `packed_simd` due to 13 previous errors
 2:56.25 warning: build failed, waiting for other jobs to finish...
 3:17.66 error: build failed
 213 PackagesBug ReportMediumLow [libffi] libffi.so7/libffi.so.8 major ABI bump Closed
100%
Task Description

make and guile made it half (and broken) to stable.
breaking the cycle required a shim package libffi33 in build-support.
packages depending of libffi are rescheduled and need to be rebuilt first, pushing libffi.so.8 to stable now would make
‘make/guile’ work again, but break a lot of other stuff!

 204 PackagesBug ReportMediumLow gdbm 1.21 fails in test 31 (convert new database format ...Closed
100%
Task Description

The bug report has been sent upstream to GDBM directly. This is too important to just ignore the failure.. (make check || true)

 195 Packages: TestingBug ReportVery LowLow libreoffice-fresh and libreoffice-still will not start  Closed
100%
Task Description

There is a problem with libreoffice-fresh and libreoffice-still which appears to be caused by the last update to boost and boost-libs which are now at version 1.76.0-1.3

~]$ libreoffice
javaldx: Could not find a Java Runtime Environment!
Warning: failed to read path from javaldx
/usr/lib/libreoffice/program/soffice.bin: error while loading shared libraries: libboost_locale.so.1.75.0: cannot open shared object file: No such file or directory
 186 PackagesBug ReportMediumLow [pacman] /etc/makeconf.conf for i486 contains flags res ...Closed
100%
Task Description

-fstack-clash-protection
-fcf-protection

We have to investiagate if one of them (or both) are
introducing illegal opcodes for i486..

 179 Packages: StableBug ReportVery LowMedium Snapper needs rebuild from icu upgrade Closed
100%
Task Description

icu69.1-1.0 however snapper still links against libicuuc.so.68

Running snapper now gives the following error:

# snapper list /
snapper: error while loading shared libraries: libicuuc.so.68: cannot open shared object file: No such file or directory
 174 PackagesBug ReportMediumLow firefox 87.0 doesn't build Closed
100%
Task Description

Again, we get into out-of-memory situations with rust:

pentium4
41:24.75   cargo:warning=src/vector_type.h:502:11: warning: ‘void* memcpy(void*, const void*, size_t)’ writing to an object of type ‘struct glsl::vec4’ with no trivial copy-assignment; use copy-assignment or copy-initialization instead [-Wclass-memaccess]
41:24.75   cargo:warning=  502 |     memcpy(&v, p, sizeof(v));
41:24.75   cargo:warning=      |     ~~~~~~^~~~~~~~~~~~~~~~~~
41:24.75   cargo:warning=In file included from src/gl.cc:78:
41:24.75   cargo:warning=src/glsl.h:1772:8: note: ‘struct glsl::vec4’ declared here
41:24.75   cargo:warning= 1772 | struct vec4 {
41:24.75   cargo:warning=      |        ^~~~
41:24.75   cargo:warning=
41:24.75   cargo:warning=cc1plus: out of memory allocating 21906724 bytes after a total of 213745664 bytes

i686
 6:42.75    Compiling geckoservo v0.0.1 (/build/firefox/src/firefox-87.0/servo/ports/geckolib)
Process Process-1:
Traceback (most recent call last):
  File "/usr/lib/python3.9/multiprocessing/process.py", line 315, in _bootstrap
    self.run()
  File "/usr/lib/python3.9/multiprocessing/process.py", line 108, in run
    self._target(*self._args, **self._kwargs)
  File "/build/firefox/src/firefox-87.0/testing/mozbase/mozsystemmonitor/mozsystemmonitor/resourcemonitor.py", line 141, in _collect
    while not _poll(pipe, poll_interval=sleep_interval):
  File "/build/firefox/src/firefox-87.0/testing/mozbase/mozsystemmonitor/mozsystemmonitor/resourcemonitor.py", line 107, in _poll
    return pipe.poll(poll_interval)
  File "/usr/lib/python3.9/multiprocessing/connection.py", line 262, in poll
    return self._poll(timeout)
  File "/usr/lib/python3.9/multiprocessing/connection.py", line 429, in _poll
    r = wait([self], timeout)
  File "/usr/lib/python3.9/multiprocessing/connection.py", line 936, in wait
    ready = selector.select(timeout)
  File "/usr/lib/python3.9/selectors.py", line 416, in select
    fd_event_list = self._selector.poll(timeout)
KeyboardInterrupt
52:46.35 make[4]: *** [/build/firefox/src/firefox-87.0/config/makefiles/rust.mk:348: force-cargo-library-build] Interrupt
52:46.35 make[3]: *** [/build/firefox/src/firefox-87.0/config/recurse.mk:72: toolkit/library/rust/target] Interrupt
52:46.35 make[2]: *** [/build/firefox/src/firefox-87.0/config/recurse.mk:34: compile] Interrupt
52:46.35 make[1]: *** [/build/firefox/src/firefox-87.0/config/rules.mk:355: default] Interrupt

Rust is 1.51.0 on both pentium4 and i686.

 165 PackagesBug ReportMediumLow xorgproto check() fails Closed
100%
Task Description

———————————– output ———————————– stderr:
Traceback (most recent call last):

File "/build/xorgproto/src/xorgproto-2021.3/scripts/keysym-generator.py", line 18, in <module>
  import libevdev

ModuleNotFoundError: No module named ‘libevdev’

root cause is python-libevdev not building:

Theme error:
sphinx_rtd_theme is no longer a hard dependency since version 1.4.0. Please install it manually.(pip install sphinx_rtd_theme)

another victim of documentation generation..

 160 PackagesBug ReportMediumLow konqueror fails to work Closed
100%
Task Description

re.so.8 error messages, re.so.9 is in stable

and then segfaults in libQt5WebEngineCore

 159 PackagesBug ReportMediumLow prjtrellis doesn't build Closed
100%
Task Description

Running Sphinx v3.5.1
/bin/sh: line 1: git: command not found
making output directory… done
WARNING: html_static_path entry ‘_static’ does not exist

Theme error:
sphinx_rtd_theme is no longer a hard dependency since version 1.4.0. Please install it manually.(pip install sphinx_rtd_theme)
{’code2docs’: {}, ‘docs2code’: {}}
make: *** [Makefile:24: html] Error 2

If I remember correctly, then some Spinx schemes need yarn to build, so they are no longer
buildable.
This means all packages needing that theme for documentation purposes are failing.

Maybe buildable without documentation for now?

 157 PackagesBug ReportMediumLow gnome-control-center and epiphany don't start due to un ...Closed
100%
Task Description

Feb 19 10:22:46 arch32-stable-pentium4 gnome-control-center.desktop[10992]: gnome-control-center: symbol lookup error: /usr/lib/libwebkit2gtk-4.0.so.37: undefined symbol: wpe_fdo_initialize_shm

 155 PackagesBug ReportMediumLow Display Manager GDM doesn't work Closed
100%
Task Description

We get the nice message “Oh no! Something has gone wrong”

 154 PackagesBug ReportMediumLow gedit fails to start Closed
100%
Task Description

gedit: error while loading shared libraries: libtepl-5.so.0: cannot open shared object file: No such file or directory

 152 PackagesBug ReportMediumLow evolution cannot be installed or upgraded Closed
100%
Task Description

:: installing evolution-data-server (3.38.3-1.1) breaks dependency ‘libedataserver-1.2.so=24-32’ required by evolution

 151 PackagesBug ReportMediumLow Gnome cannot be installed Closed
100%
Task Description

:: installing mutter (3.38.3-1.0) breaks dependency ‘libmutter-6.so=0-32’ required by gnome-shell

let’s try to push mutter, making most of gnome happy, most likely breaking gnome-shell (if not
already broken).

 146 Packages: UpstreamBug ReportMediumLow trojita doesn't build, missing a patch, failures on qt  ...Closed
100%
Task Description

=⇒ ERROR: Failure while downloading https://cgit.kde.org/trojita.git/patch/?id=cf2364b8

SHA1 in https://anongit.kde.org/trojita):

cf2364b80fa8ae844df8350cd5833d47cce235f2

    Fix possible crash when downloading attachments

Yep, promising, lets download the patch and add it to the package.

Original bug: https://bugs.kde.org/show_bug.cgi?id=417697

/build/trojita/src/trojita-0.7/src/Gui/Window.cpp:981:26: error: aggregate ‘QPainterPath path’ has incomplete type and cannot be defined
  981 |             QPainterPath path;
      |                          ^~~~

needs a #include <QPainterPath>

Reported as https://bugs.kde.org/show_bug.cgi?id=432827

 145 PackagesBug ReportMediumLow glibc 2.33 breaks i686 and i486 architectures Closed
100%
Task Description
/usr/lib/libc.6: CPU ISA level is lower than required.

updating effectively breaks all commands!

For those lucky enough to have a pacman-static installed, they can
IMMEDIATEDY downgrade glibc and keep the machine alive.

This is considered a distribution-killing bug for i486 and i686.

Pentium4 is not affectted.

 144 PackagesBug ReportMediumLow firefox fails to build Closed
100%
Task Description
/build/seamonkey/src/seamonkey-2.53.5/obj-i686-pc-linux-gnu/_virtualenv/bin/python /build/seamonkey/src/s                                                                                                           eamonkey-2.53.5/mozilla/toolkit/mozapps/installer/packager.py -DMOZ_APP_NAME=seamonkey -DPREF_DIR=default                                                                                                           s/pref -DJAREXT= -DMOZ_CALENDAR=1 -DMOZ_GTK=1 -DMOZ_IRC=1 -DMOZ_DOMINSPECTOR=1 -DMOZ_SYSTEM_NSPR=1 -DMOZ_                                                                                                           SYSTEM_NSS=1 -DMOZ_MOVEMAIL=1 -DNECKO_WIFI=1 -DMOZ_BUNDLED_FONTS=1 -DMOZ_CHILD_PROCESS_NAME=plugin-contai                                                                                                           ner -DDLL_PREFIX=lib -DDLL_SUFFIX=.so -DBIN_SUFFIX= -DDIR_MACOS= -DDIR_RESOURCES= -DBINPATH=bin -DRESPATH                                                                                                           =bin -DLPROJ_ROOT=en -DCLANG_CXX -DA11Y_LOG=1 -DACCESSIBILITY=1 -DATK_MAJOR_VERSION=2 -DATK_MINOR_VERSION                                                                                                           =36 -DATK_REV_VERSION=0 -DBUILD_CTYPES=1 -DCROSS_COMPILE='' -DD_INO=d_ino -DENABLE_INTL_API=1 -DENABLE_SY                                                                                                           STEM_EXTENSION_DIRS=1 -DEXPOSE_INTL_API=1 -DFIREFOX_VERSION=60.7.5 -DFORCE_PR_LOG=1 -DFUNCPROTO=15 -DGDK_                                                                                                           VERSION_MAX_ALLOWED=GDK_VERSION_3_4 -DGLIB_VERSION_MAX_ALLOWED=GLIB_VERSION_2_32 -DGLIB_VERSION_MIN_REQUIRED=GLIB_VERSION_2_26 -DGL_PROVIDER_GLX=1 -DHAVE_ALLOCA_H=1 -DHAVE_BYTESWAP_H=1 -DHAVE_CLOCK_MONOTONIC=1 -DHAVE_CPUID_H=1 -DHAVE_DIRENT_H=1 -DHAVE_DLADDR=1 -DHAVE_DLOPEN=1 -DHAVE_FONTCONFIG_FCFREETYPE_H=1 -DHAVE_FT_BITMAP_SIZE_Y_PPEM=1 -DHAVE_FT_GLYPHSLOT_EMBOLDEN=1 -DHAVE_FT_LOAD_SFNT_TABLE=1 -DHAVE_GETOPT_H=1 -DHAVE_GETTID=1 -DHAVE_GMTIME_R=1 -DHAVE_I18N_LC_MESSAGES=1 -DHAVE_INTTYPES_H=1 -DHAVE_LCHOWN=1 -DHAVE_LINUX_IF_ADDR_H=1 -DHAVE_LINUX_PERF_EVENT_H=1 -DHAVE_LINUX_QUOTA_H=1 -DHAVE_LINUX_RTNETLINK_H=1 -DHAVE_LOCALECONV=1 -DHAVE_LOCALTIME_R=1 -DHAVE_LSTAT64=1 -DHAVE_MALLINFO=1 -DHAVE_MALLOC_H=1 -DHAVE_MALLOC_USABLE_SIZE=1 -DHAVE_MEMALIGN=1 -DHAVE_MEMMEM=1 -DHAVE_MOVEMAIL=1 -DHAVE_NETINET_IN_H=1 -DHAVE_NL_TYPES_H=1 -DHAVE_POSIX_FADVISE=1 -DHAVE_POSIX_FALLOCATE=1 -DHAVE_POSIX_MEMALIGN=1 -DHAVE_PTHREAD_H=1 -DHAVE_RES_NINIT=1 -DHAVE_SETPRIORITY=1 -DHAVE_STAT64=1 -DHAVE_STDINT_H=1 -DHAVE_STRERROR=1 -DHAVE_STRNDUP=1 -DHAVE_SYSCALL=1 -DHAVE_SYS_QUEUE_H=1 -DHAVE_SYS_QUOTA_H=1 -DHAVE_SYS_TYPES_H=1 -DHAVE_THREAD_TLS_KEYWORD=1 -DHAVE_TRUNCATE64=1 -DHAVE_UNISTD_H=1 -DHAVE_VALLOC=1 -DHAVE_VA_COPY=1 -DHAVE_VISIBILITY_ATTRIBUTE=1 -DHAVE_VISIBILITY_HIDDEN_ATTRIBUTE=1 -DHAVE__UNWIND_BACKTRACE=1 -DHAVE___CXA_DEMANGLE=1 -DJS_DEFAULT_JITREPORT_GRANULARITY=3 -DMALLOC_H='<malloc.h>' -DMALLOC_USABLE_SIZE_CONST_PTR='' -DMOZILLA_OFFICIAL=1 -DMOZILLA_UAVERSION='"60.0"' -DMOZILLA_VERSION='"60.7.5"' -DMOZILLA_VERSION_U=60.7.5 -DMOZ_ACCESSIBILITY_ATK=1 -DMOZ_ALLOW_LEGACY_EXTENSIONS=1 -DMOZ_APP_UA_NAME='""' -DMOZ_APP_UA_VERSION='"2.53.5"' -DMOZ_AV1=1 -DMOZ_BUILD_APP=../suite -DMOZ_BUNDLED_FONTS=1 -DMOZ_CONTENT_SANDBOX=1 -DMOZ_DAV1D_ASM=1 -DMOZ_DISABLE_STARTUPCACHE=1 -DMOZ_DISTRIBUTION_ID='"org.mozilla"' -DMOZ_DLL_SUFFIX='".so"' -DMOZ_ENABLE_DBUS=1 -DMOZ_ENABLE_MASK_AS_SHORTHAND=1 -DMOZ_ENABLE_SKIA=1 -DMOZ_ENABLE_STARTUP_NOTIFICATION=1 -DMOZ_ENABLE_XREMOTE=1 -DMOZ_FEEDS=1 -DMOZ_FFMPEG=1 -DMOZ_FFVPX=1 -DMOZ_FFVPX_FLACONLY=1 -DMOZ_FMP4=1 -DMOZ_GECKO_PROFILER=1 -DMOZ_GLUE_IN_PROGRAM=1 -DMOZ_GMP_SANDBOX=1 -DMOZ_INSTRUMENT_EVENT_LOOP=1 -DMOZ_LOGGING=1 -DMOZ_MACBUNDLE_ID=org.mozilla.seamonkey -DMOZ_MEMORY=1 -DMOZ_MORK=1 -DMOZ_PEERCONNECTION=1 -DMOZ_PERMISSIONS=1 -DMOZ_PLACES=1 -DMOZ_PULSEAUDIO=1 -DMOZ_RAW=1 -DMOZ_RUST_SIMD=1 -DMOZ_SAMPLE_TYPE_FLOAT32=1 -DMOZ_SANDBOX=1 -DMOZ_SCTP=1 -DMOZ_SEPARATE_MANIFEST_FOR_THEME_OVERRIDES=1 -DMOZ_SRTP=1 -DMOZ_STATIC_JS=1 -DMOZ_SUITE=1 -DMOZ_SYSTEM_ICU=1 -DMOZ_TREE_CAIRO=1 -DMOZ_UPDATE_CHANNEL=default -DMOZ_USER_DIR='".mozilla"' -DMOZ_VORBIS=1 -DMOZ_VPX_NO_MEM_REPORTING=1 -DMOZ_WEBM_ENCODER=1 -DMOZ_WEBRTC=1 -DMOZ_WEBRTC_ASSERT_ALWAYS=1 -DMOZ_WEBRTC_SIGNALING=1 -DMOZ_WEBSPEECH=1 -DMOZ_WEBSPEECH_TEST_BACKEND=1 -DMOZ_WIDGET_GTK=3 -DMOZ_X11=1 -DMOZ_XUL=1 -DNO_NSPR_10_SUPPORT=1 -DNS_PRINTING=1 -DNS_PRINT_PREVIEW=1 -DRELEASE_OR_BETA=1 -DSTATIC_JS_API=1 -DSTDC_HEADERS=1 -DTARGET_XPCOM_ABI='"x86-gcc3"' -DUSE_SKIA=1 -DUSE_SKIA_GPU=1 -DU_USING_ICU_NAMESPACE=0 -DVA_COPY=va_copy -DVPX_X86_ASM=1 -DXP_LINUX=1 -DXP_UNIX=1 -D_REENTRANT=1 -DAB_CD=en-US \
        --format omni \
        --removals /build/seamonkey/src/seamonkey-2.53.5/suite/installer/removed-files.in \
         \
         \
         \
         \
        --optimizejars \
        --disable-compression \
        package-manifest ../../dist ../../dist/seamonkey \
        --non-resource defaults/messenger/mailViews.dat defaults/profile/panels.rdf defaults/profile/mimeTypes.rdf defaults/profile/chrome/userChrome-example.css defaults/profile/chrome/userContent-example.css 
terminate called after throwing an instance of 'std::runtime_error'
  what():  Section index out of bounds
Traceback (most recent call last):
  File "/build/seamonkey/src/seamonkey-2.53.5/mozilla/toolkit/mozapps/installer/packager.py", line 326, in <module>
    main()
  File "/build/seamonkey/src/seamonkey-2.53.5/mozilla/toolkit/mozapps/installer/packager.py", line 320, in main
    copier.copy(args.destination)
  File "/build/seamonkey/src/seamonkey-2.53.5/mozilla/python/mozbuild/mozpack/copier.py", line 428, in copy
    copy_results.append((destfile, f.copy(destfile, skip_if_older)))
  File "/build/seamonkey/src/seamonkey-2.53.5/mozilla/python/mozbuild/mozpack/files.py", line 296, in copy
    elfhack(dest)
  File "/build/seamonkey/src/seamonkey-2.53.5/mozilla/python/mozbuild/mozpack/executables.py", line 124, in elfhack
    errors.fatal('Error executing ' + ' '.join(cmd))
  File "/build/seamonkey/src/seamonkey-2.53.5/mozilla/python/mozbuild/mozpack/errors.py", line 103, in fatal
    self._handle(self.FATAL, msg)
  File "/build/seamonkey/src/seamonkey-2.53.5/mozilla/python/mozbuild/mozpack/errors.py", line 98, in _handle
    raise ErrorMessage(msg)
mozpack.errors.ErrorMessage: Error: Error executing /build/seamonkey/src/seamonkey-2.53.5/obj-i686-pc-linux-gnu/build/unix/elfhack/elfhack ../../dist/seamonkey/libxul.so
make[2]: *** [/build/seamonkey/src/seamonkey-2.53.5/mozilla/toolkit/mozapps/installer/packager.mk:22: stage-package] Error 1
make[2]: Leaving directory '/build/seamonkey/src/seamonkey-2.53.5/obj-i686-pc-linux-gnu/suite/installer'
make[1]: *** [/build/seamonkey/src/seamonkey-2.53.5/mozilla/../suite/build.mk:13: install] Error 2
make[1]: Leaving directory '/build/seamonkey/src/seamonkey-2.53.5/obj-i686-pc-linux-gnu'
make: *** [client.mk:404: install] Error 2
==> ERROR: A failure occurred in package().
    Aborting...
==> ERROR: Build failed, check /var/lib/archbuild/slave1/staging-pentium4/slave1/build
used straw: :mirrored_source:mirrored_source_by_hash:

 140 PackagesBug ReportMediumLow libproxy doesn't build Closed
100%
Task Description
-- Installing: /build/libproxy/pkg/libproxy/usr/include/proxy.h
-- Installing: /build/libproxy/pkg/libproxy/usr/bin/proxy
mv: cannot stat '/build/libproxy/pkg/libproxy/usr/lib/libproxy/*/modules/pacrunner_webkit.so': No such file or directory
==> ERROR: A failure occurred in package_libproxy().
    Aborting...
 139 PackagesBug ReportMediumLow webkit2gtk doesn't build Closed
100%
Task Description

This blocks tons of packages..

 138 PackagesBug ReportMediumLow polkit doesn't build because of a stuck js78 Closed
100%
Task Description

no task description

 137 PackagesBug ReportMediumLow llvm rebuild fails (aka sphinx requires a python module ...Closed
100%
Task Description
Configuration error:
There is a programmable error in your configuration file:

Traceback (most recent call last):
  File "/usr/lib/python3.9/site-packages/sphinx/config.py", line 326, in eval_config_file
    execfile_(filename, namespace)
  File "/usr/lib/python3.9/site-packages/sphinx/util/pycompat.py", line 88, in execfile_
    exec(code, _globals)
  File "/build/llvm/src/llvm-11.0.1.src/docs/conf.py", line 40, in <module>
    import recommonmark
ModuleNotFoundError: No module named 'recommonmark'
 135 PackagesBug ReportMediumLow namcap fails on libxkbcommon Closed
100%
Task Description
Checking PKGBUILD
Traceback (most recent call last):
  File "/usr/lib/python3.9/runpy.py", line 197, in _run_module_as_main
    return _run_code(code, main_globals, None,
  File "/usr/lib/python3.9/runpy.py", line 87, in _run_code
    exec(code, run_globals)
  File "/usr/lib/python3.9/site-packages/namcap.py", line 247, in <module>
    process_pkgbuild(package, active_modules)
  File "/usr/lib/python3.9/site-packages/namcap.py", line 153, in process_pkgbuild
    name = "PKGBUILD (" + pkginfo["name"] + ")"
  File "/usr/lib/python3.9/site-packages/Namcap/package.py", line 128, in __getitem__
    return self._data[self.canonical_varname(key)]
KeyError: 'name'
==> Running checkpkg
error: no targets specified (use -h for help)
==> WARNING: Skipped checkpkg due to missing repo packages
 129 PackagesBug ReportMediumLow rust 1.47 is outdated Closed
100%
Task Description

either building 1.49 via 1.48, via 1.47 or we have to bootstrap from a binary version again.

 128 PackagesBug ReportMediumLow newsboat needs rebuild against newer libjson-c Closed
100%
Task Description
newsboat: error while loading shared libraries: libjson-c.so.4: cannot open shared object file: No such file or directory
 127 PackagesBug ReportMediumLow iotop doesn't work Closed
100%
Task Description
root@arch32-stable-pentium4 ~]# iotop
No module named 'iotop'
To run an uninstalled copy of iotop,
launch iotop.py in the top directory

iotop is a Python script, presumably some Python modules are missing.

 123 PackagesBug ReportMediumLow libhandy0, libhandy conflicts Closed
100%
Task Description

libhandy0: /usr/share/vala/vapi/libhandy-0.0.deps exists in filesystem (owned by libhandy)
libhandy0: /usr/share/vala/vapi/libhandy-0.0.vapi exists in filesystem (owned by libhandy)

 122 PackagesBug ReportVery LowLow Permissions bits on files on the primary mirror are too ...Closed
100%
Task Description

In my quest to find a working mirror close to me, I’ve come across another issue with at least a couple of mirrors. Some mirrors respond with a HTTP 403 Forbidden for certain files, notably many of the Pacman database files. At the time of this writing, I’m aware of this problem happening with the princeton.edu and the clarkson.edu mirrors. I’ve been in contact with the admin of one of the mirrors, and they’ve pointed out that the permission bits are set to 0600 at the source. If the primary mirror could have their files be world readable, it would likely fix this problem automatically across more than one mirror.

Is that something we can do?

Steps to verify:

1. Access certain files from the primary mirror using rsync, for example:

% rsync -av rsync://mirror.archlinux32.org/archlinux32/i686/extra/extra.db.tar.gz .
receiving incremental file list
extra.db.tar.gz

sent 43 bytes  received 2,044,453 bytes  371,726.55 bytes/sec
total size is 2,043,851  speedup is 1.00

2. Examine permission bits:

% ls -l extra.db.tar.gz
-rw------- 1 user user 2043851 Jan  8 11:51 extra.db.tar.gz

Should be -rw-r–r–.

 121 PackagesBug ReportVery LowHigh Multiple packages need rebuild after libicu upgrade Closed
100%
Task Description

Over in  FS#119 , @abaumann mentioned that the libicu upgrade from 67 to 68 was part of what broke gdb. I missed the libicu upgrade when looking at gdb, but now that that one is resolved, I noticed a number of other packages that still link against the old and now nonexistant /usr/lib/libicu*.so.67 files. On my particular system, the following packages are installed, link to icu 67, and need rebuilt as well:

* harfbuzz-icu (2.7.0-1.0)
* mongo-c-driver (1.17.3-1.0)
* postfix (3.5.6-2.0)
* postgresql (12.4-1.0)
* postgresql-old-upgrade (12.5-1.0)
* samba (4.12.3-1.2)
* smbclient (4.12.3-1.2)
* syslog-ng (3.28.1-3.0)
* texlive-bin (2020.54586-4.0)
* xfsprogs (5.8.0-1.0)

… but I’m sure you have a way of determining all the affected packages?

As a workaround, in case others have the same problem, I manually extracted the old versioned .so files from the previous package to get things working again:

```
tar -C / -xf /var/cache/pacman/pkg/icu-67.1-1.0-i686.pkg.tar.zst –wildcards ‘usr/lib/lib*.so.*’ ```

- I’ll just have to remember to clean them up again later.

 119 PackagesBug ReportVery LowHigh [gdb] needs rebuilt after python upgrade Closed
100%
Task Description

Pacman recently upgraded python from 3.8 to 3.9, which breaks the gdb package:

% gdb
gdb: error while loading shared libraries: libpython3.8.so.1.0: cannot open shared object file: No such file or directory
 110 PackagesBug ReportVery LowLow [syslog-ng] is built without systemd support Closed
100%
Task Description

The packages for syslog-ng since version 3.27.1-1.0 appears to have been built without systemd support. Although their PKGBUILD runs configure with –enable-systemd, running syslog-ng –version shows Enable-Systemd: off. The official Arch x86_64 package (at version 3.28.1-1) doesn’t exhibit this problem.

I tried building the package locally on i686 using the official Arch PKGBUILD and could not reproduce the problem. My locally built version correctly finds libsystemd during configure, and gets built with systemd support. This leads me to believe the problem happens somewhere in the Archlinux32 build process.


The practical upshot of the problem is that the systemd unit file supplied with syslog-ng lists it as a Type=notify service, but when it fails to notify systemd after startup, systemd eventually kills it and restarts it repeatedly:

Jul 24 07:32:31 wolfie systemd[1]: Starting System Logger Daemon "default" instance...
Jul 24 07:32:32 wolfie syslog-ng[18977]: syslog-ng starting up; version='3.28.1'
Jul 24 07:34:01 wolfie systemd[1]: syslog-ng@default.service: start operation timed out. Terminating.
Jul 24 07:34:01 wolfie syslog-ng[18977]: syslog-ng shutting down; version='3.28.1'
Jul 24 07:34:01 wolfie systemd[1]: syslog-ng@default.service: Failed with result 'timeout'.
Jul 24 07:34:01 wolfie systemd[1]: Failed to start System Logger Daemon "default" instance.
Jul 24 07:34:02 wolfie systemd[1]: syslog-ng@default.service: Scheduled restart job, restart counter is at 1.
Jul 24 07:34:02 wolfie systemd[1]: Stopped System Logger Daemon "default" instance.
Jul 24 07:34:02 wolfie systemd[1]: Starting System Logger Daemon "default" instance...
 96 Packages: StableBug ReportMediumMedium [rust] broken or missing backend Closed
100%
Task Description
shell> echo > rust.rc <<EOF
fn main() {
        println!( "Hello Rust! " );
}
EOF

shell> rustc rust.rs
error: failed to find a `codegen-backends` folder in the sysroot candidates:
* /usr
* /usr

Presumably the i686 folders are moved around in PKGBUILD to form lib32
libraries for rust on 64-bit.

Showing tasks 101 - 150 of 350 Page 3 of 7 - 1 - 2 - 3 - 4 - 5 - Last >>

Available keyboard shortcuts

Tasklist

Task Details

Task Editing