Bugs in Archlinux32 packages, specific to 32-bit issues.

Bugs  FS#2  to  FS#92  have been recovered and may be incomplete, the
recovered Google/Bing cache data can be found here.

IDCategoryTask TypePrioritySeverity  descSummaryStatusProgress
314PackagesBug ReportVery LowLowMumble requires a outdated protobuf Unconfirmed
0%
Task Description

libprotobuf=28 is a mumble (package) dependency, but protobuf package has libprotobuf=32.

I needed to downgrade to protobuf-3.17.3-1.3-pentium4.pkg.tar.zst (from the archive) to install mumble.

336PackagesBug ReportVery LowLow[pyqt-builder]: needs rebuildUnconfirmed
0%
Task Description

just wanted to get this one on the board - i am unable to build ‘python-pyqt5’ which many other packages depend on, such as ‘qutebrowser’

the current ‘python-pyqt5’ PKGBUILD, which builds fine for x86_64 and arm, has unspecified dependencies in the i686 repos - not sure why that is

ModuleNotFoundError: No module named ‘jaraco.functools’
ModuleNotFoundError: No module named ‘jaraco.context’

that is easily fixed by requiring them explicitly:
> makedepends_i686=(’python-jaraco.context’ ‘python-jaraco.functools’)

however, after that, it gives a more fatal error:

sip-build: Unable to import ‘project.py’: No module named ‘pyqtbuild’

that module is in the ‘pyqt-builder’ package, i beleive - ‘pyqt-builder’ is installed as a build dependency; but it was built for python 3.9 - so probably that is why the build could not find the module

338PackagesBug ReportVery LowLow[libreoffice-still]: error while loading shared librari...Unconfirmed
0%
Task Description

needs rebuild against latest ‘boost’

$ sudo pacman -Sy libreoffice-still

$ pacman -Qs libreoffice-still
local/libreoffice-still 7.3.7-2.0
    LibreOffice maintenance branch

$ lowriter
javaldx: Could not find a Java Runtime Environment!
Warning: failed to read path from javaldx
/usr/lib/libreoffice/program/soffice.bin: error while loading shared libraries: libboost_locale.so.1.80.0: cannot open shared object file: No such file or directory
339PackagesBug ReportVery LowLow[libcanberra-pulse]: can not be installedUnconfirmed
0%
Task Description
# pacman -S libcanberra-pulse
resolving dependencies...
warning: cannot resolve "libcanberra=0.30+2+gc0620e4-3.2", a dependency of "libcanberra-pulse"
:: The following package cannot be upgraded due to unresolvable dependencies:
      libcanberra-pulse

:: Do you want to skip the above package for this upgrade? [y/N]
error: failed to prepare transaction (could not satisfy dependencies)
:: unable to satisfy dependency 'libcanberra=0.30+2+gc0620e4-3.2' required by libcanberra-pulse
343PackagesBug ReportVery LowLowPackage 'screen 4.9.1-1.0' is missing dependency libute...Unconfirmed
0%
Task Description

Package ‘screen 4.9.1-1.0’ is missing dependency libutempter. I assume this is because libutempter used to be a dependency of util-linux which is part of base, so was assumed to be installed.

With the regular Arch Linux distro libutempter is still a dependency of util-linux.

345PackagesBug ReportVery LowLow[gcompris-qt] doesn't start due to Qt 5.15.10Unconfirmed
0%
Task Description

I fails to start with: “Cannot mix incompatible Qt library (5.15.9) with this library (5.15.10)”

346PackagesBug ReportVery LowLowpandoc: error while loading shared librariesUnconfirmed
0%
Task Description
# pacman -Syyuu base
# pacman -S pandoc
# pandoc
pandoc: error while loading shared libraries: libHSzip-archive-0.4.1-FOOm53qGfUr2AB1Oel9iH4-ghc8.10.2.so: cannot open shared object file: No such file or directory
347PackagesBug ReportVery LowLowMeld will not start - error message -> Meld requires Gt...Unconfirmed
0%
Task Description

[keith@Arch32 ~]$ meld
Meld requires Gtk+ 3.20 or higher.
[keith@Arch32 ~]$ pacman -Qi meld
Name : meld
Version : 3.22.0-2.0
Description : Compare files, directories and working copies
Architecture : any
URL : https://meldmerge.org/ Licenses : GPL Groups : None
Provides : None
Depends On : python-gobject python-cairo gtksourceview4 gsettings-desktop-schemas dconf
Optional Deps : None
Required By : None
Optional For : None
Conflicts With : None
Replaces : None
Installed Size : 5.06 MiB
Packager : TasosSah arch32@tasossah.com Build Date : Sat 19 Aug 2023 23:25:57 BST
Install Date : Sat 26 Aug 2023 07:08:59 BST
Install Reason : Explicitly installed
Install Script : No
Validated By : Signature

[keith@Arch32 ~]$ pacman -Qi gtksourceview4
Name : gtksourceview4
Version : 4.8.4-1.0
Description : A text widget adding syntax highlighting and more to GNOME
Architecture : pentium4
URL : https://wiki.gnome.org/Projects/GtkSourceView Licenses : GPL Groups : None
Provides : libgtksourceview-4.so=0-32
Depends On : gtk3 libxml2
Optional Deps : None
Required By : meld xed
Optional For : None
Conflicts With : None
Replaces : None
Installed Size : 7.44 MiB
Packager : Andreas Baumann mail@andreasbaumann.cc Build Date : Mon 07 Nov 2022 11:50:56 GMT
Install Date : Mon 28 Nov 2022 11:49:04 GMT
Install Reason : Installed as a dependency for another package
Install Script : No
Validated By : Signature

[keith@Arch32 ~]$ pacman -Qi gtk3
Name : gtk3
Version : 1:3.24.37-1.0
Description : GObject-based multi-platform GUI toolkit
Architecture : pentium4
URL : https://www.gtk.org/ Licenses : LGPL Groups : None
Provides : gtk3-print-backends libgailutil-3.so=0-32 libgdk-3.so=0-32 libgtk-3.so=0-32
Depends On : adwaita-icon-theme atk cairo cantarell-fonts dconf desktop-file-utils fontconfig fribidi gdk-pixbuf2 glib2 harfbuzz iso-codes

                libcloudproviders  libcolord  libcups  libegl  libepoxy  libgl  librsvg  libxcomposite  libx11  libxcursor  libxdamage  libxext  libxfixes
                libxi  libxinerama  libxkbcommon  libxrandr  libxrender  pango  shared-mime-info  wayland  at-spi2-core  tracker3  gtk-update-icon-cache

Optional Deps : evince: Default print preview command
Required By : bleachbit engrampa firefox gcr gpicview gspell gtkmm3 gtksourceview4 libdbusmenu-gtk3 libgnomekbd libindicator-gtk3 libnma

                libpeas  lightdm-gtk-greeter  lxmusic  vte3  xdg-user-dirs-gtk

Optional For : avahi gvfs libcanberra libdecor libreoffice-still
Conflicts With : gtk3-print-backends
Replaces : gtk3-print-backends⇐3.22.26-1
Installed Size : 49.88 MiB
Packager : Andreas Baumann mail@andreasbaumann.cc Build Date : Sun 16 Apr 2023 11:18:09 BST
Install Date : Tue 25 Apr 2023 13:06:04 BST
Install Reason : Installed as a dependency for another package
Install Script : Yes
Validated By : Signature

[keith@Arch32 ~]$

352PackagesBug ReportVery LowLowgmtp in extra is brokenUnconfirmed
0%
Task Description

It is an i686-system.

steps to reproduce:

    1) # pacman -Syyuu base
    2) # pacman -S gmtp
    3) $ gmtp

expected result:

    Start screen of gmtp appears.

actual result:

    $ gmtp
    gmtp: error while loading shared libraries: libFLAC.so.8: cannot open shared object file: No such file or directory

gmtp in extra-staging works though

359PackagesBug ReportVery LowLowQterminal 1.3.0-1.1 is brokenUnconfirmed
0%
Task Description

Qterminal 1.3.0-1.1 is broken. It causes a segmentation fault. Upgrade to 1.4.0-1.0 (still in staging) solves this issue.

 247 PackagesBug ReportMediumLow [freetype2] requires librsvg >= 2.46.0 Closed
100%
Task Description

This could be bad because our librsvg (the Rust one) lags behind and librsvg-og might not
implement new stuff (for i486).

 295 PackagesBug ReportVery LowLow [qemu][seabios]: file conflict Closed
100%
Task Description
# pacman -S qemu seabios
resolving dependencies...
looking for conflicting packages...

Packages (2) qemu-6.2.0-4.0  seabios-1.16.0-3.2

Total Installed Size:  36.97 MiB

checking keyring...
checking package integrity...
loading package files...
checking for file conflicts...
/usr/share/qemu/bios-microvm.bin exists in both 'seabios' and 'qemu'
/usr/share/qemu/vgabios-ati.bin exists in both 'seabios' and 'qemu'
Errors occurred, no packages were upgraded.

 94 Packages: TestingBug ReportMediumLow Weechat needs a rebuild Closed
100%
Task Description

Since the uprgade to python from testing, weechat has broken it’s python support, which at least knocks out the plugin I use to keep in touch with my old workmates over slack.

# weechat
|   ___       __         ______________        _____ 
|   __ |     / /___________  ____/__  /_______ __  /_
|   __ | /| / /_  _ \  _ \  /    __  __ \  __ `/  __/
|   __ |/ |/ / /  __/  __/ /___  _  / / / /_/ // /_  
|   ____/|__/  \___/\___/\____/  /_/ /_/\__,_/ \__/  
| WeeChat 2.6 [compiled on Nov 12 2019 13:06:27]
| - - - - - - - - - - - - - - - - - - - - - - - - - - - - - - - -
| Error: unable to load plugin "/usr/lib/weechat/plugins/python.so": libpython3.7m.so.1.0: cannot open shared object file:
| No such file or directory

Inside /usr/lib/weechat/plugins there is a file named python.so, but its not any kind of link. I expect it to be fixed up if it were to be rebuilt.

 110 PackagesBug ReportVery LowLow [syslog-ng] is built without systemd support Closed
100%
Task Description

The packages for syslog-ng since version 3.27.1-1.0 appears to have been built without systemd support. Although their PKGBUILD runs configure with –enable-systemd, running syslog-ng –version shows Enable-Systemd: off. The official Arch x86_64 package (at version 3.28.1-1) doesn’t exhibit this problem.

I tried building the package locally on i686 using the official Arch PKGBUILD and could not reproduce the problem. My locally built version correctly finds libsystemd during configure, and gets built with systemd support. This leads me to believe the problem happens somewhere in the Archlinux32 build process.


The practical upshot of the problem is that the systemd unit file supplied with syslog-ng lists it as a Type=notify service, but when it fails to notify systemd after startup, systemd eventually kills it and restarts it repeatedly:

Jul 24 07:32:31 wolfie systemd[1]: Starting System Logger Daemon "default" instance...
Jul 24 07:32:32 wolfie syslog-ng[18977]: syslog-ng starting up; version='3.28.1'
Jul 24 07:34:01 wolfie systemd[1]: syslog-ng@default.service: start operation timed out. Terminating.
Jul 24 07:34:01 wolfie syslog-ng[18977]: syslog-ng shutting down; version='3.28.1'
Jul 24 07:34:01 wolfie systemd[1]: syslog-ng@default.service: Failed with result 'timeout'.
Jul 24 07:34:01 wolfie systemd[1]: Failed to start System Logger Daemon "default" instance.
Jul 24 07:34:02 wolfie systemd[1]: syslog-ng@default.service: Scheduled restart job, restart counter is at 1.
Jul 24 07:34:02 wolfie systemd[1]: Stopped System Logger Daemon "default" instance.
Jul 24 07:34:02 wolfie systemd[1]: Starting System Logger Daemon "default" instance...
 122 PackagesBug ReportVery LowLow Permissions bits on files on the primary mirror are too ...Closed
100%
Task Description

In my quest to find a working mirror close to me, I’ve come across another issue with at least a couple of mirrors. Some mirrors respond with a HTTP 403 Forbidden for certain files, notably many of the Pacman database files. At the time of this writing, I’m aware of this problem happening with the princeton.edu and the clarkson.edu mirrors. I’ve been in contact with the admin of one of the mirrors, and they’ve pointed out that the permission bits are set to 0600 at the source. If the primary mirror could have their files be world readable, it would likely fix this problem automatically across more than one mirror.

Is that something we can do?

Steps to verify:

1. Access certain files from the primary mirror using rsync, for example:

% rsync -av rsync://mirror.archlinux32.org/archlinux32/i686/extra/extra.db.tar.gz .
receiving incremental file list
extra.db.tar.gz

sent 43 bytes  received 2,044,453 bytes  371,726.55 bytes/sec
total size is 2,043,851  speedup is 1.00

2. Examine permission bits:

% ls -l extra.db.tar.gz
-rw------- 1 user user 2043851 Jan  8 11:51 extra.db.tar.gz

Should be -rw-r–r–.

 123 PackagesBug ReportMediumLow libhandy0, libhandy conflicts Closed
100%
Task Description

libhandy0: /usr/share/vala/vapi/libhandy-0.0.deps exists in filesystem (owned by libhandy)
libhandy0: /usr/share/vala/vapi/libhandy-0.0.vapi exists in filesystem (owned by libhandy)

 127 PackagesBug ReportMediumLow iotop doesn't work Closed
100%
Task Description
root@arch32-stable-pentium4 ~]# iotop
No module named 'iotop'
To run an uninstalled copy of iotop,
launch iotop.py in the top directory

iotop is a Python script, presumably some Python modules are missing.

 128 PackagesBug ReportMediumLow newsboat needs rebuild against newer libjson-c Closed
100%
Task Description
newsboat: error while loading shared libraries: libjson-c.so.4: cannot open shared object file: No such file or directory
 129 PackagesBug ReportMediumLow rust 1.47 is outdated Closed
100%
Task Description

either building 1.49 via 1.48, via 1.47 or we have to bootstrap from a binary version again.

 135 PackagesBug ReportMediumLow namcap fails on libxkbcommon Closed
100%
Task Description
Checking PKGBUILD
Traceback (most recent call last):
  File "/usr/lib/python3.9/runpy.py", line 197, in _run_module_as_main
    return _run_code(code, main_globals, None,
  File "/usr/lib/python3.9/runpy.py", line 87, in _run_code
    exec(code, run_globals)
  File "/usr/lib/python3.9/site-packages/namcap.py", line 247, in <module>
    process_pkgbuild(package, active_modules)
  File "/usr/lib/python3.9/site-packages/namcap.py", line 153, in process_pkgbuild
    name = "PKGBUILD (" + pkginfo["name"] + ")"
  File "/usr/lib/python3.9/site-packages/Namcap/package.py", line 128, in __getitem__
    return self._data[self.canonical_varname(key)]
KeyError: 'name'
==> Running checkpkg
error: no targets specified (use -h for help)
==> WARNING: Skipped checkpkg due to missing repo packages
 137 PackagesBug ReportMediumLow llvm rebuild fails (aka sphinx requires a python module ...Closed
100%
Task Description
Configuration error:
There is a programmable error in your configuration file:

Traceback (most recent call last):
  File "/usr/lib/python3.9/site-packages/sphinx/config.py", line 326, in eval_config_file
    execfile_(filename, namespace)
  File "/usr/lib/python3.9/site-packages/sphinx/util/pycompat.py", line 88, in execfile_
    exec(code, _globals)
  File "/build/llvm/src/llvm-11.0.1.src/docs/conf.py", line 40, in <module>
    import recommonmark
ModuleNotFoundError: No module named 'recommonmark'
 138 PackagesBug ReportMediumLow polkit doesn't build because of a stuck js78 Closed
100%
Task Description

no task description

 139 PackagesBug ReportMediumLow webkit2gtk doesn't build Closed
100%
Task Description

This blocks tons of packages..

 140 PackagesBug ReportMediumLow libproxy doesn't build Closed
100%
Task Description
-- Installing: /build/libproxy/pkg/libproxy/usr/include/proxy.h
-- Installing: /build/libproxy/pkg/libproxy/usr/bin/proxy
mv: cannot stat '/build/libproxy/pkg/libproxy/usr/lib/libproxy/*/modules/pacrunner_webkit.so': No such file or directory
==> ERROR: A failure occurred in package_libproxy().
    Aborting...
 144 PackagesBug ReportMediumLow firefox fails to build Closed
100%
Task Description
/build/seamonkey/src/seamonkey-2.53.5/obj-i686-pc-linux-gnu/_virtualenv/bin/python /build/seamonkey/src/s                                                                                                           eamonkey-2.53.5/mozilla/toolkit/mozapps/installer/packager.py -DMOZ_APP_NAME=seamonkey -DPREF_DIR=default                                                                                                           s/pref -DJAREXT= -DMOZ_CALENDAR=1 -DMOZ_GTK=1 -DMOZ_IRC=1 -DMOZ_DOMINSPECTOR=1 -DMOZ_SYSTEM_NSPR=1 -DMOZ_                                                                                                           SYSTEM_NSS=1 -DMOZ_MOVEMAIL=1 -DNECKO_WIFI=1 -DMOZ_BUNDLED_FONTS=1 -DMOZ_CHILD_PROCESS_NAME=plugin-contai                                                                                                           ner -DDLL_PREFIX=lib -DDLL_SUFFIX=.so -DBIN_SUFFIX= -DDIR_MACOS= -DDIR_RESOURCES= -DBINPATH=bin -DRESPATH                                                                                                           =bin -DLPROJ_ROOT=en -DCLANG_CXX -DA11Y_LOG=1 -DACCESSIBILITY=1 -DATK_MAJOR_VERSION=2 -DATK_MINOR_VERSION                                                                                                           =36 -DATK_REV_VERSION=0 -DBUILD_CTYPES=1 -DCROSS_COMPILE='' -DD_INO=d_ino -DENABLE_INTL_API=1 -DENABLE_SY                                                                                                           STEM_EXTENSION_DIRS=1 -DEXPOSE_INTL_API=1 -DFIREFOX_VERSION=60.7.5 -DFORCE_PR_LOG=1 -DFUNCPROTO=15 -DGDK_                                                                                                           VERSION_MAX_ALLOWED=GDK_VERSION_3_4 -DGLIB_VERSION_MAX_ALLOWED=GLIB_VERSION_2_32 -DGLIB_VERSION_MIN_REQUIRED=GLIB_VERSION_2_26 -DGL_PROVIDER_GLX=1 -DHAVE_ALLOCA_H=1 -DHAVE_BYTESWAP_H=1 -DHAVE_CLOCK_MONOTONIC=1 -DHAVE_CPUID_H=1 -DHAVE_DIRENT_H=1 -DHAVE_DLADDR=1 -DHAVE_DLOPEN=1 -DHAVE_FONTCONFIG_FCFREETYPE_H=1 -DHAVE_FT_BITMAP_SIZE_Y_PPEM=1 -DHAVE_FT_GLYPHSLOT_EMBOLDEN=1 -DHAVE_FT_LOAD_SFNT_TABLE=1 -DHAVE_GETOPT_H=1 -DHAVE_GETTID=1 -DHAVE_GMTIME_R=1 -DHAVE_I18N_LC_MESSAGES=1 -DHAVE_INTTYPES_H=1 -DHAVE_LCHOWN=1 -DHAVE_LINUX_IF_ADDR_H=1 -DHAVE_LINUX_PERF_EVENT_H=1 -DHAVE_LINUX_QUOTA_H=1 -DHAVE_LINUX_RTNETLINK_H=1 -DHAVE_LOCALECONV=1 -DHAVE_LOCALTIME_R=1 -DHAVE_LSTAT64=1 -DHAVE_MALLINFO=1 -DHAVE_MALLOC_H=1 -DHAVE_MALLOC_USABLE_SIZE=1 -DHAVE_MEMALIGN=1 -DHAVE_MEMMEM=1 -DHAVE_MOVEMAIL=1 -DHAVE_NETINET_IN_H=1 -DHAVE_NL_TYPES_H=1 -DHAVE_POSIX_FADVISE=1 -DHAVE_POSIX_FALLOCATE=1 -DHAVE_POSIX_MEMALIGN=1 -DHAVE_PTHREAD_H=1 -DHAVE_RES_NINIT=1 -DHAVE_SETPRIORITY=1 -DHAVE_STAT64=1 -DHAVE_STDINT_H=1 -DHAVE_STRERROR=1 -DHAVE_STRNDUP=1 -DHAVE_SYSCALL=1 -DHAVE_SYS_QUEUE_H=1 -DHAVE_SYS_QUOTA_H=1 -DHAVE_SYS_TYPES_H=1 -DHAVE_THREAD_TLS_KEYWORD=1 -DHAVE_TRUNCATE64=1 -DHAVE_UNISTD_H=1 -DHAVE_VALLOC=1 -DHAVE_VA_COPY=1 -DHAVE_VISIBILITY_ATTRIBUTE=1 -DHAVE_VISIBILITY_HIDDEN_ATTRIBUTE=1 -DHAVE__UNWIND_BACKTRACE=1 -DHAVE___CXA_DEMANGLE=1 -DJS_DEFAULT_JITREPORT_GRANULARITY=3 -DMALLOC_H='<malloc.h>' -DMALLOC_USABLE_SIZE_CONST_PTR='' -DMOZILLA_OFFICIAL=1 -DMOZILLA_UAVERSION='"60.0"' -DMOZILLA_VERSION='"60.7.5"' -DMOZILLA_VERSION_U=60.7.5 -DMOZ_ACCESSIBILITY_ATK=1 -DMOZ_ALLOW_LEGACY_EXTENSIONS=1 -DMOZ_APP_UA_NAME='""' -DMOZ_APP_UA_VERSION='"2.53.5"' -DMOZ_AV1=1 -DMOZ_BUILD_APP=../suite -DMOZ_BUNDLED_FONTS=1 -DMOZ_CONTENT_SANDBOX=1 -DMOZ_DAV1D_ASM=1 -DMOZ_DISABLE_STARTUPCACHE=1 -DMOZ_DISTRIBUTION_ID='"org.mozilla"' -DMOZ_DLL_SUFFIX='".so"' -DMOZ_ENABLE_DBUS=1 -DMOZ_ENABLE_MASK_AS_SHORTHAND=1 -DMOZ_ENABLE_SKIA=1 -DMOZ_ENABLE_STARTUP_NOTIFICATION=1 -DMOZ_ENABLE_XREMOTE=1 -DMOZ_FEEDS=1 -DMOZ_FFMPEG=1 -DMOZ_FFVPX=1 -DMOZ_FFVPX_FLACONLY=1 -DMOZ_FMP4=1 -DMOZ_GECKO_PROFILER=1 -DMOZ_GLUE_IN_PROGRAM=1 -DMOZ_GMP_SANDBOX=1 -DMOZ_INSTRUMENT_EVENT_LOOP=1 -DMOZ_LOGGING=1 -DMOZ_MACBUNDLE_ID=org.mozilla.seamonkey -DMOZ_MEMORY=1 -DMOZ_MORK=1 -DMOZ_PEERCONNECTION=1 -DMOZ_PERMISSIONS=1 -DMOZ_PLACES=1 -DMOZ_PULSEAUDIO=1 -DMOZ_RAW=1 -DMOZ_RUST_SIMD=1 -DMOZ_SAMPLE_TYPE_FLOAT32=1 -DMOZ_SANDBOX=1 -DMOZ_SCTP=1 -DMOZ_SEPARATE_MANIFEST_FOR_THEME_OVERRIDES=1 -DMOZ_SRTP=1 -DMOZ_STATIC_JS=1 -DMOZ_SUITE=1 -DMOZ_SYSTEM_ICU=1 -DMOZ_TREE_CAIRO=1 -DMOZ_UPDATE_CHANNEL=default -DMOZ_USER_DIR='".mozilla"' -DMOZ_VORBIS=1 -DMOZ_VPX_NO_MEM_REPORTING=1 -DMOZ_WEBM_ENCODER=1 -DMOZ_WEBRTC=1 -DMOZ_WEBRTC_ASSERT_ALWAYS=1 -DMOZ_WEBRTC_SIGNALING=1 -DMOZ_WEBSPEECH=1 -DMOZ_WEBSPEECH_TEST_BACKEND=1 -DMOZ_WIDGET_GTK=3 -DMOZ_X11=1 -DMOZ_XUL=1 -DNO_NSPR_10_SUPPORT=1 -DNS_PRINTING=1 -DNS_PRINT_PREVIEW=1 -DRELEASE_OR_BETA=1 -DSTATIC_JS_API=1 -DSTDC_HEADERS=1 -DTARGET_XPCOM_ABI='"x86-gcc3"' -DUSE_SKIA=1 -DUSE_SKIA_GPU=1 -DU_USING_ICU_NAMESPACE=0 -DVA_COPY=va_copy -DVPX_X86_ASM=1 -DXP_LINUX=1 -DXP_UNIX=1 -D_REENTRANT=1 -DAB_CD=en-US \
        --format omni \
        --removals /build/seamonkey/src/seamonkey-2.53.5/suite/installer/removed-files.in \
         \
         \
         \
         \
        --optimizejars \
        --disable-compression \
        package-manifest ../../dist ../../dist/seamonkey \
        --non-resource defaults/messenger/mailViews.dat defaults/profile/panels.rdf defaults/profile/mimeTypes.rdf defaults/profile/chrome/userChrome-example.css defaults/profile/chrome/userContent-example.css 
terminate called after throwing an instance of 'std::runtime_error'
  what():  Section index out of bounds
Traceback (most recent call last):
  File "/build/seamonkey/src/seamonkey-2.53.5/mozilla/toolkit/mozapps/installer/packager.py", line 326, in <module>
    main()
  File "/build/seamonkey/src/seamonkey-2.53.5/mozilla/toolkit/mozapps/installer/packager.py", line 320, in main
    copier.copy(args.destination)
  File "/build/seamonkey/src/seamonkey-2.53.5/mozilla/python/mozbuild/mozpack/copier.py", line 428, in copy
    copy_results.append((destfile, f.copy(destfile, skip_if_older)))
  File "/build/seamonkey/src/seamonkey-2.53.5/mozilla/python/mozbuild/mozpack/files.py", line 296, in copy
    elfhack(dest)
  File "/build/seamonkey/src/seamonkey-2.53.5/mozilla/python/mozbuild/mozpack/executables.py", line 124, in elfhack
    errors.fatal('Error executing ' + ' '.join(cmd))
  File "/build/seamonkey/src/seamonkey-2.53.5/mozilla/python/mozbuild/mozpack/errors.py", line 103, in fatal
    self._handle(self.FATAL, msg)
  File "/build/seamonkey/src/seamonkey-2.53.5/mozilla/python/mozbuild/mozpack/errors.py", line 98, in _handle
    raise ErrorMessage(msg)
mozpack.errors.ErrorMessage: Error: Error executing /build/seamonkey/src/seamonkey-2.53.5/obj-i686-pc-linux-gnu/build/unix/elfhack/elfhack ../../dist/seamonkey/libxul.so
make[2]: *** [/build/seamonkey/src/seamonkey-2.53.5/mozilla/toolkit/mozapps/installer/packager.mk:22: stage-package] Error 1
make[2]: Leaving directory '/build/seamonkey/src/seamonkey-2.53.5/obj-i686-pc-linux-gnu/suite/installer'
make[1]: *** [/build/seamonkey/src/seamonkey-2.53.5/mozilla/../suite/build.mk:13: install] Error 2
make[1]: Leaving directory '/build/seamonkey/src/seamonkey-2.53.5/obj-i686-pc-linux-gnu'
make: *** [client.mk:404: install] Error 2
==> ERROR: A failure occurred in package().
    Aborting...
==> ERROR: Build failed, check /var/lib/archbuild/slave1/staging-pentium4/slave1/build
used straw: :mirrored_source:mirrored_source_by_hash:

 145 PackagesBug ReportMediumLow glibc 2.33 breaks i686 and i486 architectures Closed
100%
Task Description
/usr/lib/libc.6: CPU ISA level is lower than required.

updating effectively breaks all commands!

For those lucky enough to have a pacman-static installed, they can
IMMEDIATEDY downgrade glibc and keep the machine alive.

This is considered a distribution-killing bug for i486 and i686.

Pentium4 is not affectted.

 146 Packages: UpstreamBug ReportMediumLow trojita doesn't build, missing a patch, failures on qt  ...Closed
100%
Task Description

=⇒ ERROR: Failure while downloading https://cgit.kde.org/trojita.git/patch/?id=cf2364b8

SHA1 in https://anongit.kde.org/trojita):

cf2364b80fa8ae844df8350cd5833d47cce235f2

    Fix possible crash when downloading attachments

Yep, promising, lets download the patch and add it to the package.

Original bug: https://bugs.kde.org/show_bug.cgi?id=417697

/build/trojita/src/trojita-0.7/src/Gui/Window.cpp:981:26: error: aggregate ‘QPainterPath path’ has incomplete type and cannot be defined
  981 |             QPainterPath path;
      |                          ^~~~

needs a #include <QPainterPath>

Reported as https://bugs.kde.org/show_bug.cgi?id=432827

 151 PackagesBug ReportMediumLow Gnome cannot be installed Closed
100%
Task Description

:: installing mutter (3.38.3-1.0) breaks dependency ‘libmutter-6.so=0-32’ required by gnome-shell

let’s try to push mutter, making most of gnome happy, most likely breaking gnome-shell (if not
already broken).

 152 PackagesBug ReportMediumLow evolution cannot be installed or upgraded Closed
100%
Task Description

:: installing evolution-data-server (3.38.3-1.1) breaks dependency ‘libedataserver-1.2.so=24-32’ required by evolution

 154 PackagesBug ReportMediumLow gedit fails to start Closed
100%
Task Description

gedit: error while loading shared libraries: libtepl-5.so.0: cannot open shared object file: No such file or directory

 155 PackagesBug ReportMediumLow Display Manager GDM doesn't work Closed
100%
Task Description

We get the nice message “Oh no! Something has gone wrong”

 157 PackagesBug ReportMediumLow gnome-control-center and epiphany don't start due to un ...Closed
100%
Task Description

Feb 19 10:22:46 arch32-stable-pentium4 gnome-control-center.desktop[10992]: gnome-control-center: symbol lookup error: /usr/lib/libwebkit2gtk-4.0.so.37: undefined symbol: wpe_fdo_initialize_shm

 159 PackagesBug ReportMediumLow prjtrellis doesn't build Closed
100%
Task Description

Running Sphinx v3.5.1
/bin/sh: line 1: git: command not found
making output directory… done
WARNING: html_static_path entry ‘_static’ does not exist

Theme error:
sphinx_rtd_theme is no longer a hard dependency since version 1.4.0. Please install it manually.(pip install sphinx_rtd_theme)
{’code2docs’: {}, ‘docs2code’: {}}
make: *** [Makefile:24: html] Error 2

If I remember correctly, then some Spinx schemes need yarn to build, so they are no longer
buildable.
This means all packages needing that theme for documentation purposes are failing.

Maybe buildable without documentation for now?

 160 PackagesBug ReportMediumLow konqueror fails to work Closed
100%
Task Description

re.so.8 error messages, re.so.9 is in stable

and then segfaults in libQt5WebEngineCore

 165 PackagesBug ReportMediumLow xorgproto check() fails Closed
100%
Task Description

———————————– output ———————————– stderr:
Traceback (most recent call last):

File "/build/xorgproto/src/xorgproto-2021.3/scripts/keysym-generator.py", line 18, in <module>
  import libevdev

ModuleNotFoundError: No module named ‘libevdev’

root cause is python-libevdev not building:

Theme error:
sphinx_rtd_theme is no longer a hard dependency since version 1.4.0. Please install it manually.(pip install sphinx_rtd_theme)

another victim of documentation generation..

 174 PackagesBug ReportMediumLow firefox 87.0 doesn't build Closed
100%
Task Description

Again, we get into out-of-memory situations with rust:

pentium4
41:24.75   cargo:warning=src/vector_type.h:502:11: warning: ‘void* memcpy(void*, const void*, size_t)’ writing to an object of type ‘struct glsl::vec4’ with no trivial copy-assignment; use copy-assignment or copy-initialization instead [-Wclass-memaccess]
41:24.75   cargo:warning=  502 |     memcpy(&v, p, sizeof(v));
41:24.75   cargo:warning=      |     ~~~~~~^~~~~~~~~~~~~~~~~~
41:24.75   cargo:warning=In file included from src/gl.cc:78:
41:24.75   cargo:warning=src/glsl.h:1772:8: note: ‘struct glsl::vec4’ declared here
41:24.75   cargo:warning= 1772 | struct vec4 {
41:24.75   cargo:warning=      |        ^~~~
41:24.75   cargo:warning=
41:24.75   cargo:warning=cc1plus: out of memory allocating 21906724 bytes after a total of 213745664 bytes

i686
 6:42.75    Compiling geckoservo v0.0.1 (/build/firefox/src/firefox-87.0/servo/ports/geckolib)
Process Process-1:
Traceback (most recent call last):
  File "/usr/lib/python3.9/multiprocessing/process.py", line 315, in _bootstrap
    self.run()
  File "/usr/lib/python3.9/multiprocessing/process.py", line 108, in run
    self._target(*self._args, **self._kwargs)
  File "/build/firefox/src/firefox-87.0/testing/mozbase/mozsystemmonitor/mozsystemmonitor/resourcemonitor.py", line 141, in _collect
    while not _poll(pipe, poll_interval=sleep_interval):
  File "/build/firefox/src/firefox-87.0/testing/mozbase/mozsystemmonitor/mozsystemmonitor/resourcemonitor.py", line 107, in _poll
    return pipe.poll(poll_interval)
  File "/usr/lib/python3.9/multiprocessing/connection.py", line 262, in poll
    return self._poll(timeout)
  File "/usr/lib/python3.9/multiprocessing/connection.py", line 429, in _poll
    r = wait([self], timeout)
  File "/usr/lib/python3.9/multiprocessing/connection.py", line 936, in wait
    ready = selector.select(timeout)
  File "/usr/lib/python3.9/selectors.py", line 416, in select
    fd_event_list = self._selector.poll(timeout)
KeyboardInterrupt
52:46.35 make[4]: *** [/build/firefox/src/firefox-87.0/config/makefiles/rust.mk:348: force-cargo-library-build] Interrupt
52:46.35 make[3]: *** [/build/firefox/src/firefox-87.0/config/recurse.mk:72: toolkit/library/rust/target] Interrupt
52:46.35 make[2]: *** [/build/firefox/src/firefox-87.0/config/recurse.mk:34: compile] Interrupt
52:46.35 make[1]: *** [/build/firefox/src/firefox-87.0/config/rules.mk:355: default] Interrupt

Rust is 1.51.0 on both pentium4 and i686.

 186 PackagesBug ReportMediumLow [pacman] /etc/makeconf.conf for i486 contains flags res ...Closed
100%
Task Description

-fstack-clash-protection
-fcf-protection

We have to investiagate if one of them (or both) are
introducing illegal opcodes for i486..

 195 Packages: TestingBug ReportVery LowLow libreoffice-fresh and libreoffice-still will not start  Closed
100%
Task Description

There is a problem with libreoffice-fresh and libreoffice-still which appears to be caused by the last update to boost and boost-libs which are now at version 1.76.0-1.3

~]$ libreoffice
javaldx: Could not find a Java Runtime Environment!
Warning: failed to read path from javaldx
/usr/lib/libreoffice/program/soffice.bin: error while loading shared libraries: libboost_locale.so.1.75.0: cannot open shared object file: No such file or directory
 204 PackagesBug ReportMediumLow gdbm 1.21 fails in test 31 (convert new database format ...Closed
100%
Task Description

The bug report has been sent upstream to GDBM directly. This is too important to just ignore the failure.. (make check || true)

 213 PackagesBug ReportMediumLow [libffi] libffi.so7/libffi.so.8 major ABI bump Closed
100%
Task Description

make and guile made it half (and broken) to stable.
breaking the cycle required a shim package libffi33 in build-support.
packages depending of libffi are rescheduled and need to be rebuilt first, pushing libffi.so.8 to stable now would make
‘make/guile’ work again, but break a lot of other stuff!

 215 PackagesBug ReportMediumLow firefox 93.0 (and seamonkey 2.53.9.1) doesn't build Closed
100%
Task Description
 2:52.15 error: `[u32; 2]` is forbidden as the type of a const generic parameter
 2:52.15   --> /build/firefox/src/firefox-93.0/third_party/rust/packed_simd/src/codegen/llvm.rs:20:44
 2:52.15    |
 2:52.15 20 | pub unsafe fn __shuffle_vector2<const IDX: [u32; 2], T, U>(x: T, y: T) -> U
 2:52.15    |                                            ^^^^^^^^
 2:52.15    |
 2:52.15    = note: the only supported types are integers, `bool` and `char`
 2:52.15    = help: more complex types are supported with `#![feature(adt_const_params)]`
 2:52.15 error: `[u32; 4]` is forbidden as the type of a const generic parameter
 2:52.15   --> /build/firefox/src/firefox-93.0/third_party/rust/packed_simd/src/codegen/llvm.rs:30:44
 2:52.15    |
 2:52.15 30 | pub unsafe fn __shuffle_vector4<const IDX: [u32; 4], T, U>(x: T, y: T) -> U
 2:52.15    |                                            ^^^^^^^^
 2:52.15    |
 2:52.15    = note: the only supported types are integers, `bool` and `char`
 2:52.15    = help: more complex types are supported with `#![feature(adt_const_params)]`
 2:52.15 error: `[u32; 8]` is forbidden as the type of a const generic parameter
 2:52.15   --> /build/firefox/src/firefox-93.0/third_party/rust/packed_simd/src/codegen/llvm.rs:40:44
 2:52.15    |
 2:52.15 40 | pub unsafe fn __shuffle_vector8<const IDX: [u32; 8], T, U>(x: T, y: T) -> U
 2:52.15    |                                            ^^^^^^^^
 2:52.15    |
 2:52.15    = note: the only supported types are integers, `bool` and `char`
 2:52.15    = help: more complex types are supported with `#![feature(adt_const_params)]`
 2:52.15 error: `[u32; 16]` is forbidden as the type of a const generic parameter
 2:52.15   --> /build/firefox/src/firefox-93.0/third_party/rust/packed_simd/src/codegen/llvm.rs:50:45
 2:52.15    |
 2:52.15 50 | pub unsafe fn __shuffle_vector16<const IDX: [u32; 16], T, U>(x: T, y: T) -> U
 2:52.15    |                                             ^^^^^^^^^
 2:52.15    |
 2:52.15    = note: the only supported types are integers, `bool` and `char`
 2:52.15    = help: more complex types are supported with `#![feature(adt_const_params)]`
 2:52.15 error: `[u32; 32]` is forbidden as the type of a const generic parameter
 2:52.15   --> /build/firefox/src/firefox-93.0/third_party/rust/packed_simd/src/codegen/llvm.rs:60:45
 2:52.15    |
 2:52.15 60 | pub unsafe fn __shuffle_vector32<const IDX: [u32; 32], T, U>(x: T, y: T) -> U
 2:52.15    |                                             ^^^^^^^^^
 2:52.15    |
 2:52.15    = note: the only supported types are integers, `bool` and `char`
 2:52.15    = help: more complex types are supported with `#![feature(adt_const_params)]`
 2:52.15 error: `[u32; 64]` is forbidden as the type of a const generic parameter
 2:52.15   --> /build/firefox/src/firefox-93.0/third_party/rust/packed_simd/src/codegen/llvm.rs:70:45
 2:52.15    |
 2:52.15 70 | pub unsafe fn __shuffle_vector64<const IDX: [u32; 64], T, U>(x: T, y: T) -> U
 2:52.15    |                                             ^^^^^^^^^
 2:52.15    |
 2:52.15    = note: the only supported types are integers, `bool` and `char`
 2:52.15    = help: more complex types are supported with `#![feature(adt_const_params)]`
 2:52.35    Compiling num_cpus v1.13.0
 2:53.13    Compiling fluent-langneg v0.13.0
 2:53.15    Compiling intl_pluralrules v7.0.1
 2:53.59    Compiling intl-memoizer v0.5.1
 2:55.32    Compiling gl_generator v0.14.0
 2:55.37    Compiling cose-c v0.1.5
 2:55.96    Compiling time v0.1.43
 2:56.01    Compiling iovec v0.1.4
 2:56.05    Compiling atty v0.2.14
 2:56.21 For more information about this error, try `rustc --explain E0557`.
 2:56.23    Compiling net2 v0.2.37
 2:56.24 The following warnings were emitted during compilation:
 2:56.25 warning: Cannot set `RUSTC_BOOTSTRAP=1` from build script of `packed_simd v0.3.4 (https://github.com/hsivonen/packed_simd?rev=6a16f954950401b92b4e220fbf2dfaf6f00e1fb2#6a16f954)`.
 2:56.25 note: Crates cannot set `RUSTC_BOOTSTRAP` themselves, as doing so would subvert the stability guarantees of Rust for your project.
 2:56.25 error: could not compile `packed_simd` due to 13 previous errors
 2:56.25 warning: build failed, waiting for other jobs to finish...
 3:17.66 error: build failed
 217 PackagesBug ReportMediumLow [llvm12] shim needed Closed
100%
Task Description

librsvg/rust fails because llvm is now 13 and we don’t have the llvm12-libs around anymore.
Will make a shim package.

 219 PackagesBug ReportVery LowLow [postgresql] and [postgresql-old-upgrade] links against ...Closed
100%
Task Description

After my most recent sysupgrade, postgresql refuses to start. The main postgres binary appears to be linked to multiple versions of libicu:

$  ldd /usr/bin/postgres | grep icu
	libicui18n.so.69 => /usr/lib/libicui18n.so.69 (0xb6c00000)
	libicuuc.so.69 => /usr/lib/libicuuc.so.69 (0xb6a0c000)
	libicuuc.so.70 => /usr/lib/libicuuc.so.70 (0xb6582000)
	libicudata.so.69 => /usr/lib/libicudata.so.69 (0xb4601000)
	libicudata.so.70 => /usr/lib/libicudata.so.70 

(0xb27a4000)

Installing the icu69 compatibility package made it work again, but it doesn’t look right that it should link against multiple versions.

 227 PackagesBug ReportMediumLow [object-introspection] [libosinfo] rebuild issue Closed
100%
Task Description

affects: tracker-miners tracker3-miners gnome-documents gnome-music gnome-photos nautilus

 232 PackagesBug ReportVery LowLow clementine fails on missing libprotobuf.so.27 Closed
100%
Task Description

After just having updated my trusty EeePC 1000H to be fully up to date again, I discovered that clementine is no longer working. It fails, stating that libprotobuf.so.27 cannot be found. Looking in /usr/lib, I can see libprotobuf.so.28, so I assume that the clementine package needs a rebuild.

 233 PackagesBug ReportVery LowLow Cannot install smplayer due to broken dependency Closed
100%
Task Description

I am currently unable to install smplayer in testing due to a broken dependency of mpv

[~]$ sudo pacman -S smplayer
resolving dependencies...
warning: cannot resolve "libplacebo.so=120-32", a dependency of "mpv"
warning: cannot resolve "mpv", a dependency of "smplayer"
:: The following package cannot be upgraded due to unresolvable dependencies:
      smplayer

:: Do you want to skip the above package for this upgrade? [y/N] y
looking for conflicting packages...
 there is nothing to do
 237 PackagesBug ReportVery LowLow i686: pango need to be rebuilt against harfbuzz Closed
100%
Task Description

Hi,

pango-list (and many packages depending on pango) fails to run with the following error:

$ pango-list 
pango-list: symbol lookup error: /usr/lib/libpangoft2-1.0.so.0: undefined symbol: hb_font_set_synthetic_slant

hb_font_set_synthetic_slant seems to be related to harfbuzz.

While I used Parabola i686 for the test, both pango and harfbuzz come from Arch Linux 32 i686, so Arch Linux 32 i686 should also be affected:

$ pacman -Q -o pango-list 
/usr/bin/pango-list is owned by pango 1:1.50.4-1.0
$ pacman -sS "^pango$"
extra/pango 1:1.50.4-1.0 [installed]
    A library for layout and rendering of text
$ pacman -sS "^harfbuzz$"
extra/harfbuzz 3.1.2-1.0 [installed]
    OpenType text shaping engine

Denis.

 238 PackagesBug ReportVery LowLow Linux-zen kernel 5.16.8.arch1-1.0 made with gcc 11.1 an ...Closed
100%
Task Description

Linux and Linux-zen kernel 5.16.8.arch1-1.0 made with gcc 11.1 and cannot build dkms modules with gcc 11.2

remake linux and linux-zen kernel with gcc version 11.2

 239 PackagesBug ReportMediumLow [ffmpeg] and [ffmepg4.4] fail to build Closed
100%
Task Description
libswscale/x86/rgb2rgb_template.c: In function ‘interleaveBytes_sse2’:
libswscale/x86/rgb2rgb_template.c:1838:9: error: the register ‘xmm2’ cannot be clobbered in ‘asm’ for the current target
 1838 |         __asm__(
      |         ^

Also on i486 symbols are missing if not using LTO and probing of libraries like x264/x265 fail.

 241 PackagesBug ReportVery LowLow mpd probably needs to be rebuilt against pipewire Closed
100%
Task Description

Hi,

If I run mpd, it fails to run due to a missing PW_LOG_TOPIC_DEFAULT symbol:
> $ mpd
> mpd: symbol lookup error: mpd: undefined symbol: PW_LOG_TOPIC_DEFAULT

While I run Parabola, both mpd and pipewire comes from the i686 repository of Arch Linux 32:
> extra/mpd 0.23.5-1.2 [installed]
> Flexible, powerful, server-side application for playing music
> extra/pipewire 1:0.3.36-1.0 [installed]
> Low-latency audio/video router and processor

If I look on a x86_64 Parabola installation instead, PW_LOG_TOPIC_DEFAULT can be found in libpipewire:
> $ readelf -s /usr/lib/libpipewire-0.3.so.0 | grep PW_LOG_
> 383: 00000000000d7128 8 OBJECT GLOBAL DEFAULT 21 > PW_LOG_TOPIC_DEFAULT

But that command returns nothing on Parabola i686.

Denis.

Showing tasks 101 - 150 of 350 Page 3 of 7 - 1 - 2 - 3 - 4 - 5 - Last >>

Available keyboard shortcuts

Tasklist

Task Details

Task Editing