Bugs in Archlinux32 packages, specific to 32-bit issues.

Bugs  FS#2  to  FS#92  have been recovered and may be incomplete, the
recovered Google/Bing cache data can be found here.

IDCategoryTask TypePriority  ascSeveritySummaryStatusProgress
 353 PackagesBug ReportVery LowLow mc: is broken Closed
100%
Task Description
$ mc
mc: symbol lookup error: mc: undefined symbol: g_string_new_take

$ mcedit
mcedit: symbol lookup error: mcedit: undefined symbol: g_string_new_take
 354 PackagesBug ReportVery LowLow staging mkinitcpio<->cryptsetup conflict Closed
100%
Task Description

it is not possible to enable staging

$ sudo pacman -Syuu
:: Synchronizing package databases...
 core-staging is up to date
 core is up to date
 extra-staging                      2.5 MiB  2.22 MiB/s 00:01 [##################################] 100%
 extra is up to date
 community-staging is up to date
 community is up to date
:: Starting full system upgrade...
resolving dependencies...
:: There are 2 providers available for dbus-units:
:: Repository core-staging
   1) dbus-broker-units  2) dbus-daemon-units

Enter a number (default=1): 
looking for conflicting packages...
:: cryptsetup and mkinitcpio are in conflict. Remove mkinitcpio? [y/N] y
error: failed to prepare transaction (could not satisfy dependencies)
:: unable to satisfy dependency 'initramfs' required by linux
 357 PackagesBug ReportVery LowMedium pacman-contrib 1.10.5 requires rebuild Closed
100%
Task Description

The pactree tool in pacman-contrib 1.10.5 requires libalpm.so.13 which belongs to an older version of pacman. Rebuilding pacman-contrib with the latest version of pacman installed should resolve the issue.

100Packages: StableBug ReportVery LowLowmldonkey crashesUnconfirmed
0%
Task Description

All versions of mldonkey crash in arch32 updated. (segmentation fault and core dumped)

108Packages: StagingBug ReportVery LowHighlldb fails to run any binary (error: failed to launch o...Unconfirmed
0%
Task Description

Very easy to reproduce. lldb version 10.0.0, just try to run any binary.

[aeden@arch32 bin]$ lldb $(which date)
(lldb) target create “/usr/bin/date” Current executable set to ‘/usr/bin/date’ (i386).
(lldb) run
error: failed to launch or debug process
(lldb)

117PackagesBug ReportVery LowLowvboxdrive module missingNew
0%
Task Description

vboxdrv module is missing making virtualbox unusable.

I’m currently running kernel 5.9.0-1.0-pae but it doesn’t seem to be there in any version

172PackagesBug ReportVery LowMediumiwd requires some kernel flagsUnconfirmed
0%
Task Description

RC4 support not found
The following options are missing in the kernel:

CONFIG_CRYPTO_USER_API_SKCIPHER
CONFIG_CRYPTO_ECB
CONFIG_CRYPTO_ARC4
209PackagesBug ReportVery LowLowIntel High Definition Audio issue.Unconfirmed
0%
Task Description

I am using Arch Linux 32 latest version on Sony VAIO VGN-FS215Z . The following is the audio device:

-fs215z:~$ lspci | grep -i audio

00:1b.0 Audio device: Intel Corporation 82801FB/FBM/FR/FW/FRW (ICH6 Family) High Definition Audio Controller (rev 03)

When I boot the system after some time getting crackling sound in speaker. Sometimes it stops after few minutes and sometimes continue to sound. Really annoying. I am not getting the normal audio in any application. This problem was there in debian based OSs also but not there in any other OS.

Please help.

210PackagesBug ReportVery LowMediumkeymap don't gets fixed on login as set in /etc/vconsol...Unconfirmed
0%
Task Description

gzip comes with asm code, if enabled, built a TEXTREL which gets bloqued on boot, so systemd don’t set keymap
A lot of tricks in forums, old thread more complete here $506 An old problem. Work around while asm gets fixed is call configure with DEFS=”NO_ASM” like this:

...
export DEFS="NO_ASM"
./configure ....

or,

./configure DEFS="NO_ASM" ....

I have not tested it, but gentoo on x32 have gzip like this and no TEXTRELS here.
No matter i486, i686 or pentium.

Hope it helps.

Best regards.

243PackagesBug ReportVery LowMedium[linux and linux-zen] 5.16.12 needs a rebuild with gcc...New
0%
Task Description

[linux and linux-zen] 5.16.12 needs a rebuild with gcc 11.2 so DKMS packages will work

get errors when dkms installing in make log

cc1: error: incompatible gcc/plugin versions
cc1: error: failed to initialize plugin ./scripts/gcc-plugins/structleak_plugin.so

283PackagesBug ReportVery LowLow[icu70/icu71 ] packages not rebuilt yetAssigned
0%
Task Description

starting to collect them here packages which require icu69 (and have thus not been rebuilt
for icu 71 yet):

libreoffice-fresh

287PackagesFeature RequestVery LowLowchromium not able to buildAssigned
0%
Task Description

Wait unfortunately i found a patch through which chromium would compile on x86

please try to build chromium using those patches

https://github.com/void-linux/void-packages/blob/master/srcpkgs/chromium/patches/reenable-linux-i686-builds.patch https://github.com/void-linux/void-packages/blob/master/srcpkgs/chromium/patches/chromium-i686-vaapi-fpermissive.patch https://github.com/void-linux/void-packages/blob/master/srcpkgs/chromium/patches/chromium-105-bitmap-include.patch https://github.com/void-linux/void-packages/blob/master/srcpkgs/chromium/patches/chromium-105-browser-include.patch

294PackagesBug ReportVery LowHigh[qtile] importlib.metadata.PackageNotFoundError: No pac...Assigned
0%
Task Description

When running qtile I get the following error message:

[qtile] importlib.metadata.PackageNotFoundError: No package metadata was found for qtile

Running qtile on Arch Linux works as expected.

$ qtile start
Traceback (most recent call last):
  File "/usr/bin/qtile", line 33, in <module>
    sys.exit(load_entry_point('qtile==0.18.1', 'console_scripts', 'qtile')())
  File "/usr/bin/qtile", line 22, in importlib_load_entry_point
    for entry_point in distribution(dist_name).entry_points
  File "/usr/lib/python3.10/importlib/metadata/__init__.py", line 957, in distribution
    return Distribution.from_name(distribution_name)
  File "/usr/lib/python3.10/importlib/metadata/__init__.py", line 548, in from_name
    raise PackageNotFoundError(name)
importlib.metadata.PackageNotFoundError: No package metadata was found for qtile
$ pacman -Qi qtile
Name            : qtile
Version         : 0.18.1-3.0
Description     : A full-featured, pure-Python tiling window manager
Architecture    : pentium4
URL             : http://www.qtile.org
Licenses        : MIT
Groups          : None
Provides        : None
Depends On      : gdk-pixbuf2  glibc  libnotify  librsvg  pango  python-cairocffi  python-cffi  python-xcffib  python-gobject  python-setuptools
Optional Deps   : alsa-utils: for volume widget
                  canto-daemon: for canto widget
                  cmus: for cmus widget
                  jupyter_console: for interaction with qtile via Jupyter
                  khal: for khal_calendar widget
                  libpulse: for pulse_volume and pulseaudio_ffi widget [installed]
                  lm_sensors: for sensors widget [installed]
                  moc: for moc widget
                  python-dbus-next: for utils, notifications and several widgets
                  python-iwlib: for wlan widget
                  python-keyring: for imapwidget widget
                  python-mpd2: mpd2widget widget
                  python-psutil: graph, net and memory widget [installed]
                  python-pywlroots: for experimental wayland support
                  python-setproctitle: change process name to qtile
                  python-xdg: launchbar widget
Required By     : None
Optional For    : None
Conflicts With  : None
Replaces        : None
Installed Size  : 3.25 MiB
Packager        : Andreas Baumann <mail@andreasbaumann.cc>
Build Date      : Mon 04 Oct 2021 12:02:58
Install Date    : Mon 26 Sep 2022 13:33:45
Install Reason  : Explicitly installed
Install Script  : Yes
Validated By    : Signature
$ sudo pacman -Syu
:: Synchronizing package databases...
 core downloading...
 extra downloading...
 community downloading...
:: Starting full system upgrade...
 there is nothing to do
314PackagesBug ReportVery LowLowMumble requires a outdated protobuf Unconfirmed
0%
Task Description

libprotobuf=28 is a mumble (package) dependency, but protobuf package has libprotobuf=32.

I needed to downgrade to protobuf-3.17.3-1.3-pentium4.pkg.tar.zst (from the archive) to install mumble.

322Packages: StableBug ReportVery LowMediumfile header absentNew
0%
Task Description

on fresh install file /usr/lib/libbfd.so lacks header “/* GNU ld script */” so I see complains on terminal

325PackagesBug ReportVery LowHigh[terminus] crashes with message undefined symbol: cairo...Unconfirmed
0%
Task Description

Starting terminus gives following error:

from ._cairo import *  # noqa: F401,F403
ImportError: /usr/lib/python3.10/site-packages/cairo/_cairo.cpython-310-i386-linux-gnu.so: undefined symbol: cairo_tee_surface_index

Bug seens to be related to

https://bugs.archlinux.org/task/77367

There is generall mess on cairo related files for different architectures (pentium4, i486, i686) - some packages for one architecture are outdated, while for other archictectures are up to date, for instance:

  • python-cairo i486/extra : 1.21.0-1.0
  • python-cairo i686/extra : 1.23.0-3.0
  • python-cairo pentium4/extra : 1.23.0-3.0
333PackagesBug ReportVery LowHighSddm 0.19.0-9.0 crashes with Qt 5.15.9Assigned
0%
Task Description

The current version of sddm (0.19.0-9.0) depends on the previous version of Qt (5.15.8). After updating Qt, sddm crashes with an incompatible Qt library error.

335PackagesBug ReportVery LowMediumpython-setuptools-scm 7.1.0-4.1 missing dependencyUnconfirmed
0%
Task Description

python-setuptools-scm 7.1.0-4.1 as found in the repo is missing the dependencies python-packaging and python-setuptools, which breaks the build of many other packages.

336PackagesBug ReportVery LowLow[pyqt-builder]: needs rebuildUnconfirmed
0%
Task Description

just wanted to get this one on the board - i am unable to build ‘python-pyqt5’ which many other packages depend on, such as ‘qutebrowser’

the current ‘python-pyqt5’ PKGBUILD, which builds fine for x86_64 and arm, has unspecified dependencies in the i686 repos - not sure why that is

ModuleNotFoundError: No module named ‘jaraco.functools’
ModuleNotFoundError: No module named ‘jaraco.context’

that is easily fixed by requiring them explicitly:
> makedepends_i686=(’python-jaraco.context’ ‘python-jaraco.functools’)

however, after that, it gives a more fatal error:

sip-build: Unable to import ‘project.py’: No module named ‘pyqtbuild’

that module is in the ‘pyqt-builder’ package, i beleive - ‘pyqt-builder’ is installed as a build dependency; but it was built for python 3.9 - so probably that is why the build could not find the module

338PackagesBug ReportVery LowLow[libreoffice-still]: error while loading shared librari...Unconfirmed
0%
Task Description

needs rebuild against latest ‘boost’

$ sudo pacman -Sy libreoffice-still

$ pacman -Qs libreoffice-still
local/libreoffice-still 7.3.7-2.0
    LibreOffice maintenance branch

$ lowriter
javaldx: Could not find a Java Runtime Environment!
Warning: failed to read path from javaldx
/usr/lib/libreoffice/program/soffice.bin: error while loading shared libraries: libboost_locale.so.1.80.0: cannot open shared object file: No such file or directory
339PackagesBug ReportVery LowLow[libcanberra-pulse]: can not be installedUnconfirmed
0%
Task Description
# pacman -S libcanberra-pulse
resolving dependencies...
warning: cannot resolve "libcanberra=0.30+2+gc0620e4-3.2", a dependency of "libcanberra-pulse"
:: The following package cannot be upgraded due to unresolvable dependencies:
      libcanberra-pulse

:: Do you want to skip the above package for this upgrade? [y/N]
error: failed to prepare transaction (could not satisfy dependencies)
:: unable to satisfy dependency 'libcanberra=0.30+2+gc0620e4-3.2' required by libcanberra-pulse
340PackagesBug ReportVery LowCritical[chromium] broken due to outdated libraries, plus also ...Unconfirmed
0%
Task Description

The package needs to be recompiled for re2 v10 and several required dependencies were not installed, such as icu69 (?) and more.

341PackagesBug ReportVery LowCriticalpython3 is version 11, but all packages install only 3....Unconfirmed
0%
Task Description

From a fresh install just now:

The /usr/lib/python3.10/site-packages folder is full of dozens of files, but there is little in the 3.11 folder. Some examples: gajim yt-dlp zippy samba.

This seems to affect most new packages that I install, so it is by no means limited to just the examples.

342PackagesBug ReportVery LowVery Lownmap missing dependency openssl-1.1Unconfirmed
0%
Task Description

no task description

343PackagesBug ReportVery LowLowPackage 'screen 4.9.1-1.0' is missing dependency libute...Unconfirmed
0%
Task Description

Package ‘screen 4.9.1-1.0’ is missing dependency libutempter. I assume this is because libutempter used to be a dependency of util-linux which is part of base, so was assumed to be installed.

With the regular Arch Linux distro libutempter is still a dependency of util-linux.

345PackagesBug ReportVery LowLow[gcompris-qt] doesn't start due to Qt 5.15.10Unconfirmed
0%
Task Description

I fails to start with: “Cannot mix incompatible Qt library (5.15.9) with this library (5.15.10)”

346PackagesBug ReportVery LowLowpandoc: error while loading shared librariesUnconfirmed
0%
Task Description
# pacman -Syyuu base
# pacman -S pandoc
# pandoc
pandoc: error while loading shared libraries: libHSzip-archive-0.4.1-FOOm53qGfUr2AB1Oel9iH4-ghc8.10.2.so: cannot open shared object file: No such file or directory
347PackagesBug ReportVery LowLowMeld will not start - error message -> Meld requires Gt...Unconfirmed
0%
Task Description

[keith@Arch32 ~]$ meld
Meld requires Gtk+ 3.20 or higher.
[keith@Arch32 ~]$ pacman -Qi meld
Name : meld
Version : 3.22.0-2.0
Description : Compare files, directories and working copies
Architecture : any
URL : https://meldmerge.org/ Licenses : GPL Groups : None
Provides : None
Depends On : python-gobject python-cairo gtksourceview4 gsettings-desktop-schemas dconf
Optional Deps : None
Required By : None
Optional For : None
Conflicts With : None
Replaces : None
Installed Size : 5.06 MiB
Packager : TasosSah arch32@tasossah.com Build Date : Sat 19 Aug 2023 23:25:57 BST
Install Date : Sat 26 Aug 2023 07:08:59 BST
Install Reason : Explicitly installed
Install Script : No
Validated By : Signature

[keith@Arch32 ~]$ pacman -Qi gtksourceview4
Name : gtksourceview4
Version : 4.8.4-1.0
Description : A text widget adding syntax highlighting and more to GNOME
Architecture : pentium4
URL : https://wiki.gnome.org/Projects/GtkSourceView Licenses : GPL Groups : None
Provides : libgtksourceview-4.so=0-32
Depends On : gtk3 libxml2
Optional Deps : None
Required By : meld xed
Optional For : None
Conflicts With : None
Replaces : None
Installed Size : 7.44 MiB
Packager : Andreas Baumann mail@andreasbaumann.cc Build Date : Mon 07 Nov 2022 11:50:56 GMT
Install Date : Mon 28 Nov 2022 11:49:04 GMT
Install Reason : Installed as a dependency for another package
Install Script : No
Validated By : Signature

[keith@Arch32 ~]$ pacman -Qi gtk3
Name : gtk3
Version : 1:3.24.37-1.0
Description : GObject-based multi-platform GUI toolkit
Architecture : pentium4
URL : https://www.gtk.org/ Licenses : LGPL Groups : None
Provides : gtk3-print-backends libgailutil-3.so=0-32 libgdk-3.so=0-32 libgtk-3.so=0-32
Depends On : adwaita-icon-theme atk cairo cantarell-fonts dconf desktop-file-utils fontconfig fribidi gdk-pixbuf2 glib2 harfbuzz iso-codes

                libcloudproviders  libcolord  libcups  libegl  libepoxy  libgl  librsvg  libxcomposite  libx11  libxcursor  libxdamage  libxext  libxfixes
                libxi  libxinerama  libxkbcommon  libxrandr  libxrender  pango  shared-mime-info  wayland  at-spi2-core  tracker3  gtk-update-icon-cache

Optional Deps : evince: Default print preview command
Required By : bleachbit engrampa firefox gcr gpicview gspell gtkmm3 gtksourceview4 libdbusmenu-gtk3 libgnomekbd libindicator-gtk3 libnma

                libpeas  lightdm-gtk-greeter  lxmusic  vte3  xdg-user-dirs-gtk

Optional For : avahi gvfs libcanberra libdecor libreoffice-still
Conflicts With : gtk3-print-backends
Replaces : gtk3-print-backends⇐3.22.26-1
Installed Size : 49.88 MiB
Packager : Andreas Baumann mail@andreasbaumann.cc Build Date : Sun 16 Apr 2023 11:18:09 BST
Install Date : Tue 25 Apr 2023 13:06:04 BST
Install Reason : Installed as a dependency for another package
Install Script : Yes
Validated By : Signature

[keith@Arch32 ~]$

351Packages: StableBug ReportVery LowMediumVarious python-X packages building for Python 3.10 and ...New
0%
Task Description

yes, confirmed, that’s because python 3.11 is the only package building and being
published to stable, the python modules need bootstrapping (since months).

352PackagesBug ReportVery LowLowgmtp in extra is brokenUnconfirmed
0%
Task Description

It is an i686-system.

steps to reproduce:

    1) # pacman -Syyuu base
    2) # pacman -S gmtp
    3) $ gmtp

expected result:

    Start screen of gmtp appears.

actual result:

    $ gmtp
    gmtp: error while loading shared libraries: libFLAC.so.8: cannot open shared object file: No such file or directory

gmtp in extra-staging works though

359PackagesBug ReportVery LowLowQterminal 1.3.0-1.1 is brokenUnconfirmed
0%
Task Description

Qterminal 1.3.0-1.1 is broken. It causes a segmentation fault. Upgrade to 1.4.0-1.0 (still in staging) solves this issue.

360PackagesBug ReportVery LowCriticalArchlinux32-Keyring was trusted but became untrustedUnconfirmed
0%
Task Description

some months ago I installed archlinux32 on my eeepc. I followed the steps on the archlinux32.org downloads page to fix my keyring. I was able to use pacman just fine. Yesterday I went to update the system and got trust issues with the archlinux32-keyring. I think this has something to do with the updated archlinux-keyring. I have removed archlinux-keyring from the system.

I joined the IRC and have been working on how to resolve the issue with no luck.

First i updated the mirrorlist from the link in the downloads page as noted to fix pacman with a working install.
I forced the pacman-key to update the trust database my editing /usr/bin/pacman-key line 613 to

if ! "${GPG_PACMAN[@]}" --batch --check-trustdb --yes; then

so Here is what happens when I try to pacman -Syu:

[Loops@eeepc901 ~]$ sudo pacman -Syu                                                                                                                        
:: Synchronizing package databases...
 core                                                              131.4 KiB   128 KiB/s 00:01 [#######################################################] 100%
 extra                                                               7.5 MiB  2.10 MiB/s 00:04 [#######################################################] 100%
 community is up to date
:: Starting full system upgrade...
resolving dependencies...
looking for conflicting packages...

Packages (43) alsa-lib-1.2.12-1.0  alsa-ucm-conf-1.2.12-1.0  aom-3.9.1-1.0  ca-certificates-20240618-1.0  ca-certificates-mozilla-3.101-1.0
              ca-certificates-utils-20240618-1.0  e2fsprogs-1.47.1-4.0  ell-0.66-1.0  findutils-4.10.0-1.0  fribidi-1.0.15-1.0  git-2.45.2-1.0
              hicolor-icon-theme-0.18-1.0  hwdata-0.383-1.0  libcups-2:2.4.10-1.0  libdrm-2.4.122-1.0  libevdev-1.13.2-1.0  libgcrypt-1.11.0-2.0
              libinput-1.26.1-1.0  libnghttp2-1.62.1-1.0  libogg-1.3.5-2.0  libproxy-0.5.7-1.0  librsvg-2:2.58.1-1.0  libwacom-2.12.1-1.0
              linux-6.9.7.arch1-1.2  linux-api-headers-6.7-1.1  linux-firmware-20240610.9c10a208-1.0  linux-firmware-whence-20240610.9c10a208-1.0
              lynx-2.9.2-1.0  mkinitcpio-39.2-2.0  nettle-3.10-1.0  nspr-4.35-3.0  nss-3.101-1.0  openssh-9.8p1-1.1  openssl-3.3.1-1.0
              pacman-mirrorlist-20240616-1.2  pciutils-3.13.0-1.0  qt5-base-5.15.14+kde+r141-1.0  qt5-translations-5.15.14-1.0  sqlite-3.46.0-1.0
              wayland-1.23.0-1.0  xkeyboard-config-2.42-1.0  xz-5.6.2-1.0  zstd-1.5.6-1.0

Total Download Size:     1.47 MiB
Total Installed Size:  515.71 MiB
Net Upgrade Size:      -59.78 MiB

:: Proceed with installation? [Y/n] 
:: Retrieving packages...
 libgcrypt-1.11.0-2.0-pentium4                                     612.7 KiB   726 KiB/s 00:01 [#######################################################] 100%
 libdrm-2.4.122-1.0-pentium4                                       343.2 KiB  2.13 MiB/s 00:00 [#######################################################] 100%
 libinput-1.26.1-1.0-pentium4                                      292.8 KiB  1331 KiB/s 00:00 [#######################################################] 100%
 libcups-2:2.4.10-1.0-pentium4                                     261.6 KiB  1355 KiB/s 00:00 [#######################################################] 100%
 Total (4/4)                                                      1510.3 KiB   717 KiB/s 00:02 [#######################################################] 100%
(43/43) checking keys in keyring                                                               [#######################################################] 100%
(43/43) checking package integrity                                                             [#######################################################] 100%
error: alsa-ucm-conf: signature from "TasosSah (Arch32 Package Signing Key) <arch32@tasossah.com>" is unknown trust
:: File /var/cache/pacman/pkg/alsa-ucm-conf-1.2.12-1.0-any.pkg.tar.zst is corrupted (invalid or corrupted package (PGP signature)).
Do you want to delete it? [Y/n]  
error: linux-api-headers: signature from "Andreas Baumann (sign) <mail@andreasbaumann.cc>" is unknown trust
:: File /var/cache/pacman/pkg/linux-api-headers-6.7-1.1-any.pkg.tar.zst is corrupted (invalid or corrupted package (PGP signature)).
Do you want to delete it? [Y/n] 
error: alsa-lib: signature from "Andreas Baumann (sign) <mail@andreasbaumann.cc>" is unknown trust
:: File /var/cache/pacman/pkg/alsa-lib-1.2.12-1.0-pentium4.pkg.tar.zst is corrupted (invalid or corrupted package (PGP signature)).
Do you want to delete it? [Y/n] 
error: aom: signature from "TasosSah (Arch32 Package Signing Key) <arch32@tasossah.com>" is unknown trust
:: File /var/cache/pacman/pkg/aom-3.9.1-1.0-pentium4.pkg.tar.zst is corrupted (invalid or corrupted package (PGP signature)).
Do you want to delete it? [Y/n] 
error: findutils: signature from "Andreas Baumann (sign) <mail@andreasbaumann.cc>" is unknown trust
:: File /var/cache/pacman/pkg/findutils-4.10.0-1.0-pentium4.pkg.tar.zst is corrupted (invalid or corrupted package (PGP signature)).
Do you want to delete it? [Y/n] 
error: openssl: signature from "Andreas Baumann (sign) <mail@andreasbaumann.cc>" is unknown trust
:: File /var/cache/pacman/pkg/openssl-3.3.1-1.0-pentium4.pkg.tar.zst is corrupted (invalid or corrupted package (PGP signature)).
Do you want to delete it? [Y/n] 
error: sqlite: signature from "TasosSah (Arch32 Package Signing Key) <arch32@tasossah.com>" is unknown trust
:: File /var/cache/pacman/pkg/sqlite-3.46.0-1.0-pentium4.pkg.tar.zst is corrupted (invalid or corrupted package (PGP signature)).
Do you want to delete it? [Y/n] 
error: e2fsprogs: signature from "Andreas Baumann (sign) <mail@andreasbaumann.cc>" is unknown trust
:: File /var/cache/pacman/pkg/e2fsprogs-1.47.1-4.0-pentium4.pkg.tar.zst is corrupted (invalid or corrupted package (PGP signature)).
Do you want to delete it? [Y/n] 
error: libgcrypt: signature from "Andreas Baumann (sign) <mail@andreasbaumann.cc>" is unknown trust
:: File /var/cache/pacman/pkg/libgcrypt-1.11.0-2.0-pentium4.pkg.tar.zst is corrupted (invalid or corrupted package (PGP signature)).
Do you want to delete it? [Y/n] 
error: xz: signature from "Andreas Baumann (sign) <mail@andreasbaumann.cc>" is unknown trust
:: File /var/cache/pacman/pkg/xz-5.6.2-1.0-pentium4.pkg.tar.zst is corrupted (invalid or corrupted package (PGP signature)).
Do you want to delete it? [Y/n] 
error: zstd: signature from "Andreas Baumann (sign) <mail@andreasbaumann.cc>" is unknown trust
:: File /var/cache/pacman/pkg/zstd-1.5.6-1.0-pentium4.pkg.tar.zst is corrupted (invalid or corrupted package (PGP signature)).
Do you want to delete it? [Y/n] 
error: ca-certificates-utils: signature from "TasosSah (Arch32 Package Signing Key) <arch32@tasossah.com>" is unknown trust
:: File /var/cache/pacman/pkg/ca-certificates-utils-20240618-1.0-any.pkg.tar.zst is corrupted (invalid or corrupted package (PGP signature)).
Do you want to delete it? [Y/n] 
error: ca-certificates-mozilla: signature from "Andreas Baumann (sign) <mail@andreasbaumann.cc>" is unknown trust
:: File /var/cache/pacman/pkg/ca-certificates-mozilla-3.101-1.0-pentium4.pkg.tar.zst is corrupted (invalid or corrupted package (PGP signature)).
Do you want to delete it? [Y/n] 
error: ca-certificates: signature from "TasosSah (Arch32 Package Signing Key) <arch32@tasossah.com>" is unknown trust
:: File /var/cache/pacman/pkg/ca-certificates-20240618-1.0-any.pkg.tar.zst is corrupted (invalid or corrupted package (PGP signature)).
Do you want to delete it? [Y/n] 
error: ell: signature from "Andreas Baumann (sign) <mail@andreasbaumann.cc>" is unknown trust
:: File /var/cache/pacman/pkg/ell-0.66-1.0-pentium4.pkg.tar.zst is corrupted (invalid or corrupted package (PGP signature)).
Do you want to delete it? [Y/n] 
error: fribidi: signature from "TasosSah (Arch32 Package Signing Key) <arch32@tasossah.com>" is unknown trust
:: File /var/cache/pacman/pkg/fribidi-1.0.15-1.0-pentium4.pkg.tar.zst is corrupted (invalid or corrupted package (PGP signature)).
Do you want to delete it? [Y/n] 
error: libnghttp2: signature from "TasosSah (Arch32 Package Signing Key) <arch32@tasossah.com>" is unknown trust
:: File /var/cache/pacman/pkg/libnghttp2-1.62.1-1.0-pentium4.pkg.tar.zst is corrupted (invalid or corrupted package (PGP signature)).
Do you want to delete it? [Y/n] 
error: git: signature from "TasosSah (Arch32 Package Signing Key) <arch32@tasossah.com>" is unknown trust
:: File /var/cache/pacman/pkg/git-2.45.2-1.0-pentium4.pkg.tar.zst is corrupted (invalid or corrupted package (PGP signature)).
Do you want to delete it? [Y/n] 
error: hicolor-icon-theme: signature from "TasosSah (Arch32 Package Signing Key) <arch32@tasossah.com>" is unknown trust
:: File /var/cache/pacman/pkg/hicolor-icon-theme-0.18-1.0-any.pkg.tar.zst is corrupted (invalid or corrupted package (PGP signature)).
Do you want to delete it? [Y/n] 
error: hwdata: signature from "TasosSah (Arch32 Package Signing Key) <arch32@tasossah.com>" is unknown trust
:: File /var/cache/pacman/pkg/hwdata-0.383-1.0-any.pkg.tar.zst is corrupted (invalid or corrupted package (PGP signature)).
Do you want to delete it? [Y/n] 
error: nettle: signature from "Andreas Baumann (sign) <mail@andreasbaumann.cc>" is unknown trust
:: File /var/cache/pacman/pkg/nettle-3.10-1.0-pentium4.pkg.tar.zst is corrupted (invalid or corrupted package (PGP signature)).
Do you want to delete it? [Y/n] 
error: libcups: signature from "Andreas Baumann (sign) <mail@andreasbaumann.cc>" is unknown trust
:: File /var/cache/pacman/pkg/libcups-2:2.4.10-1.0-pentium4.pkg.tar.zst is corrupted (invalid or corrupted package (PGP signature)).
Do you want to delete it? [Y/n] 
error: libdrm: signature from "Andreas Baumann (sign) <mail@andreasbaumann.cc>" is unknown trust
:: File /var/cache/pacman/pkg/libdrm-2.4.122-1.0-pentium4.pkg.tar.zst is corrupted (invalid or corrupted package (PGP signature)).
Do you want to delete it? [Y/n] 
error: libevdev: signature from "TasosSah (Arch32 Package Signing Key) <arch32@tasossah.com>" is unknown trust
:: File /var/cache/pacman/pkg/libevdev-1.13.2-1.0-pentium4.pkg.tar.zst is corrupted (invalid or corrupted package (PGP signature)).
Do you want to delete it? [Y/n] 
error: libwacom: signature from "TasosSah (Arch32 Package Signing Key) <arch32@tasossah.com>" is unknown trust
:: File /var/cache/pacman/pkg/libwacom-2.12.1-1.0-pentium4.pkg.tar.zst is corrupted (invalid or corrupted package (PGP signature)).
Do you want to delete it? [Y/n] 
error: libinput: signature from "Andreas Baumann (sign) <mail@andreasbaumann.cc>" is unknown trust
:: File /var/cache/pacman/pkg/libinput-1.26.1-1.0-pentium4.pkg.tar.zst is corrupted (invalid or corrupted package (PGP signature)).
Do you want to delete it? [Y/n] 
error: libogg: signature from "TasosSah (Arch32 Package Signing Key) <arch32@tasossah.com>" is unknown trust
:: File /var/cache/pacman/pkg/libogg-1.3.5-2.0-pentium4.pkg.tar.zst is corrupted (invalid or corrupted package (PGP signature)).
Do you want to delete it? [Y/n] 
error: libproxy: signature from "TasosSah (Arch32 Package Signing Key) <arch32@tasossah.com>" is unknown trust
:: File /var/cache/pacman/pkg/libproxy-0.5.7-1.0-pentium4.pkg.tar.zst is corrupted (invalid or corrupted package (PGP signature)).
Do you want to delete it? [Y/n] 
error: librsvg: signature from "TasosSah (Arch32 Package Signing Key) <arch32@tasossah.com>" is unknown trust
:: File /var/cache/pacman/pkg/librsvg-2:2.58.1-1.0-pentium4.pkg.tar.zst is corrupted (invalid or corrupted package (PGP signature)).
Do you want to delete it? [Y/n] 
error: mkinitcpio: signature from "Andreas Baumann (sign) <mail@andreasbaumann.cc>" is unknown trust
:: File /var/cache/pacman/pkg/mkinitcpio-39.2-2.0-any.pkg.tar.zst is corrupted (invalid or corrupted package (PGP signature)).
Do you want to delete it? [Y/n] 
error: linux: signature from "Andreas Baumann (sign) <mail@andreasbaumann.cc>" is unknown trust
:: File /var/cache/pacman/pkg/linux-6.9.7.arch1-1.2-pentium4.pkg.tar.zst is corrupted (invalid or corrupted package (PGP signature)).
Do you want to delete it? [Y/n] 
error: linux-firmware-whence: signature from "TasosSah (Arch32 Package Signing Key) <arch32@tasossah.com>" is unknown trust
:: File /var/cache/pacman/pkg/linux-firmware-whence-20240610.9c10a208-1.0-any.pkg.tar.zst is corrupted (invalid or corrupted package (PGP signature)).
Do you want to delete it? [Y/n] 
error: linux-firmware: signature from "TasosSah (Arch32 Package Signing Key) <arch32@tasossah.com>" is unknown trust
:: File /var/cache/pacman/pkg/linux-firmware-20240610.9c10a208-1.0-any.pkg.tar.zst is corrupted (invalid or corrupted package (PGP signature)).
Do you want to delete it? [Y/n] 
error: lynx: signature from "Andreas Baumann (sign) <mail@andreasbaumann.cc>" is unknown trust
:: File /var/cache/pacman/pkg/lynx-2.9.2-1.0-pentium4.pkg.tar.zst is corrupted (invalid or corrupted package (PGP signature)).
Do you want to delete it? [Y/n] 
error: nspr: signature from "Andreas Baumann (sign) <mail@andreasbaumann.cc>" is unknown trust
:: File /var/cache/pacman/pkg/nspr-4.35-3.0-pentium4.pkg.tar.zst is corrupted (invalid or corrupted package (PGP signature)).
Do you want to delete it? [Y/n] 
error: nss: signature from "Andreas Baumann (sign) <mail@andreasbaumann.cc>" is unknown trust
:: File /var/cache/pacman/pkg/nss-3.101-1.0-pentium4.pkg.tar.zst is corrupted (invalid or corrupted package (PGP signature)).
Do you want to delete it? [Y/n] 
error: openssh: signature from "Andreas Baumann (sign) <mail@andreasbaumann.cc>" is unknown trust
:: File /var/cache/pacman/pkg/openssh-9.8p1-1.1-pentium4.pkg.tar.zst is corrupted (invalid or corrupted package (PGP signature)).
Do you want to delete it? [Y/n] 
error: pacman-mirrorlist: signature from "TasosSah (Arch32 Package Signing Key) <arch32@tasossah.com>" is unknown trust
:: File /var/cache/pacman/pkg/pacman-mirrorlist-20240616-1.2-any.pkg.tar.zst is corrupted (invalid or corrupted package (PGP signature)).
Do you want to delete it? [Y/n] 
error: pciutils: signature from "Andreas Baumann (sign) <mail@andreasbaumann.cc>" is unknown trust
:: File /var/cache/pacman/pkg/pciutils-3.13.0-1.0-pentium4.pkg.tar.zst is corrupted (invalid or corrupted package (PGP signature)).
Do you want to delete it? [Y/n] 
error: qt5-translations: signature from "TasosSah (Arch32 Package Signing Key) <arch32@tasossah.com>" is unknown trust
:: File /var/cache/pacman/pkg/qt5-translations-5.15.14-1.0-any.pkg.tar.zst is corrupted (invalid or corrupted package (PGP signature)).
Do you want to delete it? [Y/n] 
error: wayland: signature from "TasosSah (Arch32 Package Signing Key) <arch32@tasossah.com>" is unknown trust
:: File /var/cache/pacman/pkg/wayland-1.23.0-1.0-pentium4.pkg.tar.zst is corrupted (invalid or corrupted package (PGP signature)).
Do you want to delete it? [Y/n] 
error: xkeyboard-config: signature from "TasosSah (Arch32 Package Signing Key) <arch32@tasossah.com>" is unknown trust
:: File /var/cache/pacman/pkg/xkeyboard-config-2.42-1.0-any.pkg.tar.zst is corrupted (invalid or corrupted package (PGP signature)).
Do you want to delete it? [Y/n] 
error: qt5-base: signature from "TasosSah (Arch32 Package Signing Key) <arch32@tasossah.com>" is unknown trust
:: File /var/cache/pacman/pkg/qt5-base-5.15.14+kde+r141-1.0-pentium4.pkg.tar.zst is corrupted (invalid or corrupted package (PGP signature)).
Do you want to delete it? [Y/n] 
error: failed to commit transaction (invalid or corrupted package (PGP signature))
Errors occurred, no packages were upgraded.

The Next course of action seems to be resetting the keyring It was suggested I follow a guide on the parabola wiki: https://wiki.parabola.nu/Parabola_Keyring#Resetting_the_Parabola_Keyring

 2 Packages: StableBug ReportMediumLow this is a test-issue for [lapack] (not a real bug) - Ar ...Closed
100%
Task Description

07.11.2017 -  FS#2  - this is a test-issue for [lapack] (not a real bug). human: ignore this build master: do not ignore this. Closed by Erich Eckner 07.11.2017 …

 3 Packages: StableBug ReportMediumLow [ffmpeg] missing FLAC codec Closed
100%
Task Description

Opened by Andreas Baumann - 07.11.2017
Last edited by Erich Eckner - 07.11.2017
 FS#3  - [ffmpeg] missing FLAC codec

Playing 10.Motion_Picture_Soundtrack.flac.
Audio only file format detected.
Load subtitles in ./

Opening audio decoder: [ffmpeg] FFmpeg/libavcodec audio decoders
[flac @ 0xb68902c0]Got unexpected packet size after a partial decode
[flac @ 0xb68902c0]Got unexpected packet size after a partial decode
[flac @ 0xb68902c0]Got unexpected packet size after a partial decode
[flac @ 0xb68902c0]Got unexpected packet size after a partial decode
[flac @ 0xb68902c0]Got unexpected packet size after a partial decode
[flac @ 0xb68902c0]Got unexpected packet size after a partial decode
ADecoder init failed sad
ADecoder init failed sad
Cannot find codec for audio format 0x43614C66.
Audio: no sound
Video: no video

Levi commented on 16.05.2019 20:08

How do I check this? I tested inputting a file to ffmpeg using the -i option and it acted like the output of ffprobe reporting things like the duration correctly before barfing that I hadn’t supplied it with any outputs. Is this fixed therefore?
Admin
Andreas Baumann commented on 17.08.2019 12:23

Output #0, flac, to ‘Kid A (2000)/10.Motion_Picture_Soundtrack.flac’:
Output file #0 does not contain any stream

and this on 64-bit.

I don’t think, flac support is there in ffmpeg

Google Cache

Bing Cache

 4 Packages: StableBug ReportMediumLow [virtualbox-guest-utils] 5.2.0 version broken  Closed
100%
Task Description

Attached to Project: Archlinux32
Opened by Andreas Baumann - 07.11.2017
Last edited by Andreas Baumann - 17.12.2017
 FS#4  - [virtualbox-guest-utils] 5.2.0 version broken

When starting a virtual machine you get:

VBoxClient: VBoxClient (seamless): failed to start. Stage: Setting guest IRQ filter mask Error: VERR_INTERNAL_ERROR

The solution is to use the guest ISO 5.2.1 for now till the package is upgraded.
Closed by Andreas Baumann
17.12.2017 20:22
Reason for closing: Fixed
Additional comments about closing:

Seems to work now. the modules load, the desktop adapts nicely. mouse works. closing this one.

Comments

Admin
Erich Eckner commented on 17.12.2017 18:46

is this still the case with 5.2.2?
Admin
Andreas Baumann commented on 17.12.2017 18:52

I’ll have to test on a virtualbox vm..

Google Cache

Bing Cache

 5 PackagesBug ReportMediumLow [sbcl] fails to compile - Arch Linux Closed
100%
Task Description

16.12.2017 - The best, I can get is trying to compile the git HEAD with clisp (instead of sbcl). However, this still errors with: entering make-target-2.sh

 6 PackagesBug ReportMediumLow [libreoffice-still] 5.3.7-4 crashes when opening a ... Closed
100%
Task Description

07.11.2017 - Nov 07 18:19:32 arch32-testing systemd[1]: Started Process Core Dump (PID 643/UID 0). Nov 07 18:19:35 arch32-testing …

 7 PackagesBug ReportMediumLow unknown bug FS#7 Closed
100%
Task Description

no task description

 8 Packages: Build-listBug ReportMediumLow [skia-sharp] [skia-sharp58] build fails Closed
100%
Task Description

Attached to Project: Archlinux32
Opened by Erich Eckner - 11.11.2017
Last edited by Andreas Baumann - 12.11.2017
 FS#8  - [skia-sharp] [skia-sharp58] build fails

/startdir/PKGBUILD: line 63: bin/gn: No such file or directory

strange about this:
- works on x86_64
- bin/gn is there and executable
Closed by Andreas Baumann
12.11.2017 14:19
Reason for closing: Won’t implement
Additional comments about closing:

blacklist, no visible 32-bit support.

Comments (7)

Admin
Andreas Baumann commented on 12.11.2017 12:29

When compiling on 64-bit I get several binaries:

src/depot_tools/gn
src/skia/gn
src/skia/buildtools/linux64/gn
src/skia/bin/gn

maybe one with linux32 is missing?
Admin
Andreas Baumann commented on 12.11.2017 12:30

Other things in PKGBUILD:

export PYTHON=’/usr/bin/pyton2’

This hardly works. :-) Admin
Andreas Baumann commented on 12.11.2017 12:31

The line with bin/gn is a little bit tricky. I’ll try to put an absolute path there..
Admin
Andreas Baumann commented on 12.11.2017 12:32

I also don’t like the ideas of pushd and popd everywhere..
Admin
Andreas Baumann commented on 12.11.2017 12:33

file bin/gn
bin/gn: ELF 64-bit LSB executable, x86-64, version 1 (SYSV), dynamically linked, interpreter /lib64/ld-linux-x86-64.so.2, for GNU/Linux 2.6.26, BuildID[sha1]=6d551c57efec95b400b9890f89a18e407396c917, stripped

So the file not found means: it exists, but has not been compiled for the correct architecture.
Admin
Andreas Baumann commented on 12.11.2017 13:57

So, removing bin/gn and calling python2 tools/git-sync-deps fetches me a new copy.
Admin
Andreas Baumann commented on 12.11.2017 14:14

So tools/git-sync-deps does:

   subprocess.check_call(
  [sys.executable,
   os.path.join(os.path.dirname(deps_file_path), 'bin', 'fetch-gn')])

which has:

gn_path = ‘buildtools/linux64/gn’ if ‘linux’ in sys.platform else \

      'buildtools/mac/gn'     if 'darwin' in sys.platform else \
      'buildtools/win/gn.exe'

fetching things from Chromium:

f.write(urllib2.urlopen('https://chromium-gn.storage-download.googleapis.com/' + sha1).read())

Changing linux64 to linux32 in a naive approach didn’t fetch a bin/gn.

So I would actually blacklist both packages.

Google Cache

 9 Packages: Build-listBug ReportMediumLow [ffmpeg] [ffmpeg2.8] libtheora not found Closed
100%
Task Description

Attached to Project: Archlinux32
Opened by Erich Eckner - 11.11.2017
Last edited by Andreas Baumann - 12.11.2017
 FS#9  - [ffmpeg] [ffmpeg2.8] libtheora not found

==&gt; Starting build()… ERROR: libtheora not found

… but it’s there:
/var/lib/archbuild/staging-i686/erich/usr/lib/libtheora.so.0.3.10
/var/lib/archbuild/staging-i686/erich/usr/lib/libtheora.so.0
/var/lib/archbuild/staging-i686/erich/usr/lib/libtheora.so

strange … Closed by Andreas Baumann
12.11.2017 15:40
Reason for closing: Fixed
Additional comments about closing:

fixed in libogg.

  Comments (5)
  Related Tasks (0/0)

Admin
Andreas Baumann commented on 12.11.2017 14:29

more ffbuild/config.log

BEGIN /tmp/ffconf.6IlfdMzU/test.c

  1   #include 
  2   #include 
  3   long check_th_info_init(void) { return (long) th_info_init; }
  4   int main(void) { int ret = 0;
  5    ret |= ((intptr_t)check_th_info_init) &amp; 0xFFFF;
  6   return ret; }

END /tmp/ffconf.6IlfdMzU/test.c
gcc -D_ISOC99_SOURCE -D_FILE_OFFSET_BITS=64 -D_LARGEFILE_SOURCE -D_POSIX_C_SOURCE=200112 -D_XOPEN_SOURCE=
600 -DPIC -std=c11 -fomit-frame-pointer -fPIC -pthread -I/usr/include/p11-kit-1 -I/usr/include/freetype2
-I/usr/include/libpng16 -I/usr/include/harfbuzz -I/usr/include/glib-2.0 -I/usr/lib/glib-2.0/include -I/us
r/include/fribidi -I/usr/include/freetype2 -I/usr/include/libpng16 -I/usr/include/harfbuzz -I/usr/include
/glib-2.0 -I/usr/lib/glib-2.0/include -I/usr/include/freetype2 -I/usr/include/libpng16 -I/usr/include/har
/
…skipping
In file included from /usr/include/ogg/os_types.h:144:0,

               from /usr/include/ogg/ogg.h:25,
               from /usr/include/theora/theoraenc.h:24,
               from /tmp/ffconf.6IlfdMzU/test.c:1:

/usr/include/ogg/config_types.h:4:10: fatal error: config_types-32.h: No such file or directory
#include “config_types-32.h”

        ^~~~~~~~~~~~~~~~~~~

compilation terminated.
ERROR: libtheora not found

Admin
Andreas Baumann commented on 12.11.2017 14:31

/usr/include/ogg/config_types.h

#if WORDSIZE == 32
#include “config_types-32.h” #elif
WORDSIZE == 64
#include “config_types-64.h” #else
#error “Unknown word size” #endif

ls /usr/include/ogg/
config_types-64.h config_types.h ogg.h os_types.h

So ogg misses the 32-bit types header file.. I’ll check there..
Admin
Andreas Baumann commented on 12.11.2017 14:54

Trying a patch in libogg:

sed

  s|mv "${pkgdir}"/usr/include/ogg/config_types{,-64}.h|mv "${pkgdir}"/usr/include/ogg/config_types{,-32}.h|

Admin
Andreas Baumann commented on 12.11.2017 14:57

acutally: better remove the whole multilib stuff on 32-bit..
Admin
Andreas Baumann commented on 12.11.2017 15:39

eval “$(

declare -f package | \
  sed '
    /^.*Resolve multilib conflict/,/^}$/{//p;d;}
  '

)”

Back to first version, I’m not a sed-king (rather the very opposite).

Google Cache

 10 PackagesBug ReportMediumLow unknown bug FS#10 Closed
100%
Task Description

no task description

 11 PackagesBug ReportMediumLow unknown bug FS#11 Closed
100%
Task Description

no task description

 12 Packages: Build-listBug ReportMediumLow [python-setuptools] check() fails (due to some mpmath i ...Closed
100%
Task Description

Attached to Project: Archlinux32
Opened by Erich Eckner - 15.11.2017
Last edited by Andreas Baumann - 02.10.2019
 FS#12  - [python-setuptools] check() fails (due to some mpmath issue?)

during check():
_ sympy/polys/tests/test_rootoftools.py:test_CRootOf_evalf _

File “/build/python-sympy/src/sympy-sympy-1.1.1-py2/sympy/polys/tests/test_rootoftools.py”, line 225, in test_CRootOf_evalf

a, b = rootof(eq, 1).n(2).as_real_imag()

File “sympy/core/evalf.py”, line 1394, in evalf

result = evalf(self, prec + 4, options)

File “sympy/core/evalf.py”, line 1292, in evalf

xe = x._eval_evalf(prec)

File “sympy/polys/rootoftools.py”, line 644, in _eval_evalf

x0 = mpc(*map(str, interval.center))

File “/usr/lib/python2.7/site-packages/mpmath/ctx_mp_python.py”, line 374, in new

imag = cls.context.mpf(imag)

File “/usr/lib/python2.7/site-packages/mpmath/ctx_mp_python.py”, line 77, in new

v._mpf_ = mpf_pos(cls.mpf_convert_arg(val, prec, rounding), prec, rounding)

File “/usr/lib/python2.7/site-packages/mpmath/ctx_mp_python.py”, line 84, in mpf_convert_arg

if isinstance(x, basestring): return from_str(x, prec, rounding)

File “/usr/lib/python2.7/site-packages/mpmath/libmp/libmpf.py”, line 1300, in from_str

return from_rational(int(p), int(q), prec, rnd)

ValueError: invalid literal for int() with base 10: ‘-2163048125L’
tests finished: 6841 passed, 185 skipped, 1 exceptions, in 4352.49 seconds

DO *NOT* COMMIT!
test process starts

executable: /usr/bin/python2 (2.7.14-final-0) [CPython]
architecture: 32-bit
cache: yes
ground types: gmpy 2.0.8
hash randomization: on (PYTHONHASHSEED=3003103148)
Closed by Andreas Baumann
02.10.2019 19:15
Reason for closing: Fixed
Additional comments about closing:

Seems to run the tests just fine on i686 and pentium4.

Google Cache

Bing Cache

 13 PackagesBug ReportMediumLow [fox-devel] fails on 32-bit Intel - Arch Linux Closed
100%
Task Description

16.11.2017 - It’s the development version of the FOX toolkit. Breaks in some int/FXival/void * abstractions: FXWSQueue.cpp: In member function ‘FX::FXbool …

 14 PackagesBug ReportMediumLow [ghc-mod] Needs rebuilt Closed
100%
Task Description

Attached to Project: Archlinux32
Opened by Luke Shumaker - 21.11.2017
Last edited by Erich Eckner - 25.11.2017
 FS#14  - [ghc-mod] Needs rebuilt

Yesterday, I mentioned on IRC that many haskell packages need rebuilt. In response, deep42thought moved a bunch of packages from staging to stable, and told me to open a bug report if the issue persisted.

For the most part, this seems resolved. Some pacman -Qo/-Ql/ldd/grep magic tells me that all of the haskell packages I have are fine, except for [ghc-mod].
Closed by Erich Eckner
25.11.2017 14:58
Reason for closing: Fixed
Additional comments about closing:

removed - upstream removed it, too

  Comments (1)
  Related Tasks (0/0)

Luke Shumaker commented on 23.11.2017 04:47

deep42thought has removed ghc-mod, reflecting its removal in Arch. Requesting closure.

Google Cache

 15 Packages: StableBug ReportMediumLow [extra/m17n-lib] needs rebuilt for icu 60 Closed
100%
Task Description

Attached to Project: Archlinux32
Opened by Luke Shumaker - 22.11.2017
Last edited by Erich Eckner - 28.11.2017
 FS#15  - [extra/m17n-lib] needs rebuilt for icu 60

extra/m17n-lib 1.7.0-1 is built against icu 59; it needs rebuilt against icu 60 (which moved from staging to stable on Monday).
Closed by Erich Eckner
28.11.2017 08:14
Reason for closing: Fixed
Additional comments about closing:

unfortunately, the fixed package has same version - so you need to force update that one.

  Comments (1)
  Related Tasks (0/0)

Admin
Andreas Baumann commented on 23.11.2017 09:55

I checked on stable, seems ok to me now:

ldd /usr/lib/libm17n.so.0.4.1

    linux-gate.so.1 (0xb7f9c000)
    libm17n-core.so.0 =&gt; /usr/lib/libm17n-core.so.0 (0xb7f12000)
    libdl.so.2 =&gt; /usr/lib/libdl.so.2 (0xb7f0d000)
    libc.so.6 =&gt; /usr/lib/libc.so.6 (0xb7d37000)
    libxml2.so.2 =&gt; /usr/lib/libxml2.so.2 (0xb7bb7000)
    libz.so.1 =&gt; /usr/lib/libz.so.1 (0xb7b9e000)
    liblzma.so.5 =&gt; /usr/lib/liblzma.so.5 (0xb7b72000)
    libicui18n.so.60 =&gt; /usr/lib/libicui18n.so.60 (0xb78bc000)
    libicuuc.so.60 =&gt; /usr/lib/libicuuc.so.60 (0xb7702000)
    libicudata.so.60 =&gt; /usr/lib/libicudata.so.60 (0xb5d6c000)
    libm.so.6 =&gt; /usr/lib/libm.so.6 (0xb5c70000)
    /usr/lib/ld-linux.so.2 (0xb7f9e000)
    libpthread.so.0 =&gt; /usr/lib/libpthread.so.0 (0xb5c4f000)
    libstdc++.so.6 =&gt; /usr/lib/libstdc++.so.6 (0xb5ad5000)
    libgcc_s.so.1 =&gt; /usr/lib/libgcc_s.so.1 (0xb5ab8000)

Google Cache

 16 PackagesBug ReportMediumLow [libreoffice-still] still using icu 59 - Arch Linux Closed
100%
Task Description

 FS#16  : [libreoffice-still] still using icu 59 - Arch Linux
28.11.2017 - /usr/lib/libreoffice/program/soffice.bin: error while loading shared libraries: libicuuc.so.59: cannot open shared object file: No such file or …

 17 PackagesBug ReportMediumLow nvidia and nvidia-lts kernel module build failure on 32 ...Closed
100%
Task Description

26.11.2017 - In file included from ./arch/x86/include/asm/page.h:75:0, from ./arch/x86/include/asm/thread_info.h:11, from ./include/linux/thread_info.h:37, …

 18 PackagesBug ReportMediumLow  [android-tools] missing a -latomic when linking adb .. Closed
100%
Task Description

08.12.2017 -  FS#18  - [android-tools] missing a -latomic when linking adb (and maybe other utilities). Didn’t find the place where to report this upstream!?

 19 PackagesBug ReportMediumLow unknown bug FS#19 Closed
100%
Task Description

no task description

Showing tasks 101 - 150 of 351 Page 3 of 8 - 1 - 2 - 3 - 4 - 5 - Last >>

Available keyboard shortcuts

Tasklist

Task Details

Task Editing