Bugs in Archlinux32 packages, specific to 32-bit issues.

Bugs  FS#2  to  FS#92  have been recovered and may be incomplete, the
recovered Google/Bing cache data can be found here.

IDCategoryTask TypePriority  ascSeveritySummaryStatusProgress
 293 PackagesBug ReportVery LowLow Please update those packages:- Closed
100%
Task Description

Gimp
Krita

If possible can u add Julia Lang though its on blacklist but i will try to compile it :)

 295 PackagesBug ReportVery LowLow [qemu][seabios]: file conflict Closed
100%
Task Description
# pacman -S qemu seabios
resolving dependencies...
looking for conflicting packages...

Packages (2) qemu-6.2.0-4.0  seabios-1.16.0-3.2

Total Installed Size:  36.97 MiB

checking keyring...
checking package integrity...
loading package files...
checking for file conflicts...
/usr/share/qemu/bios-microvm.bin exists in both 'seabios' and 'qemu'
/usr/share/qemu/vgabios-ati.bin exists in both 'seabios' and 'qemu'
Errors occurred, no packages were upgraded.

 296 PackagesBug ReportVery LowLow Fix terminal emulators  Closed
100%
Task Description

On arch32 currently foot and alacritty is broken

 297 PackagesBug ReportVery LowLow jack2 can not install Closed
100%
Task Description
# pacman -S jack --noconfirm
:: There are 2 providers available for jack:
:: Repository extra
   1) jack2  2) pipewire-jack

Enter a number (default=1): 
resolving dependencies...
warning: cannot resolve "libcelt0.so=2-32", a dependency of "jack2"
:: The following package cannot be upgraded due to unresolvable dependencies:
      jack2

:: Do you want to skip the above package for this upgrade? [y/N] error: failed to prepare transaction (could not satisfy dependencies)

:: unable to satisfy dependency 'libcelt0.so=2-32' required by jack2
 298 PackagesBug ReportVery LowLow Please update Arduino Closed
100%
Task Description

Arduino is out dated and my teacher said to use the latest arduino version 1.8.x for the robotics class…

 299 PackagesFeature RequestVery LowLow [dart] request for bootstrapping dart Closed
100%
Task Description

The dart sdk files are still availble for ia32:-
https://storage.googleapis.com/dart-archive/channels/stable/release/2.18.2/sdk/dartsdk-linux-ia32-release.zip

can you send the old PKGBUILD which was used

 300 PackagesBug ReportVery LowLow Pinta needs to be updated Closed
100%
Task Description

please update pinta i am facing problems with p.net clone and the closest is pinta so if u look to update it then it would be greatful

 301 PackagesBug ReportVery LowLow [dino]: wont start Closed
100%
Task Description
# pacman -Syu dino
$ dino
main.vala:25: Fatal error: /usr/lib/libgupnp-1.2.so.1: undefined symbol: gssdp_client_can_reach
 302 DevopsFeature RequestVery LowLow Are you gonna continue 486 support? Closed
100%
Task Description

https://www.tomshardware.com/news/linux-removes-486-cpu-support

486 will be removed from the kernel and especially from 6.1 onwards rust will be integrated with the kernel…

 303 PackagesBug ReportVery LowLow codeblocks issue.. Closed
100%
Task Description

its requested that please push the codeblocks testing to stable..

 308 PackagesBug ReportVery LowLow gettext needs a rebuild for libunistring Closed
100%
Task Description

I’m on pentium4 and I’m getting:

/usr/bin/xgettext: error while loading shared libraries: libunistring.so.2: cannot open shared object file: No such file or directory
/usr/bin/msgmerge: error while loading shared libraries: libunistring.so.2: cannot open shared object file: No such file or directory
/usr/bin/msgfmt: error while loading shared libraries: libunistring.so.2: cannot open shared object file: No such file or directory

gettext 0.21.1-1.1
libunistring 1.1-2.0

 309 PackagesBug ReportVery LowLow gcompris links to openssl-1.1.so Closed
100%
Task Description

```
gcompris-qt: error while loading shared libraries: libssl.so.1.1: cannot open shared object file: No such file or directory
```

 312 PackagesBug ReportVery LowLow In testing calibre will not start Closed
100%
Task Description
[keith@Arch32 ~]$ calibre
Failed to import PyQt module: PyQt6.QtQuick with error: No module named 'PyQt6.QtQuick'
Traceback (most recent call last):
  File "/usr/bin/calibre", line 21, in <module>
    sys.exit(calibre())
  File "/usr/lib/calibre/calibre/gui_launch.py", line 73, in calibre
    main(args)
  File "/usr/lib/calibre/calibre/gui2/main.py", line 546, in main
    app, opts, args = init_qt(args)
  File "/usr/lib/calibre/calibre/gui2/main.py", line 123, in init_qt
    app = Application(args, override_program_name=override, windows_app_uid=MAIN_APP_UID)
  File "/usr/lib/calibre/calibre/gui2/__init__.py", line 1096, in __init__
    setup_to_run_webengine()
  File "/usr/lib/calibre/calibre/gui2/__init__.py", line 1078, in setup_to_run_webengine
    from qt.core import QQuickWindow, QSGRendererInterface
ImportError: cannot import name 'QQuickWindow' from 'qt.core' (/usr/lib/calibre/qt/core.py)
[keith@Arch32 ~]$ calibre --version
calibre (calibre 6.7.1)
[keith@Arch32 ~]$ 
314PackagesBug ReportVery LowLowMumble requires a outdated protobuf Unconfirmed
0%
Task Description

libprotobuf=28 is a mumble (package) dependency, but protobuf package has libprotobuf=32.

I needed to downgrade to protobuf-3.17.3-1.3-pentium4.pkg.tar.zst (from the archive) to install mumble.

 315 Packages: StableBug ReportVery LowLow [ncmpcpp] requires wrongly boost libraries  Closed
100%
Task Description

ncmpcpp-git compiles on AUR with no problem with all dependencies found on AL32 repositories.

 318 PackagesBug ReportVery LowLow [multiple]: Note: This key has expired! Closed
100%
Task Description
$ wget http://pool.mirror.archlinux32.org/i686/core/binutils-2.40-2.0-i686.pkg.tar.zst
$ wget http://pool.mirror.archlinux32.org/i686/core/binutils-2.40-2.0-i686.pkg.tar.zst.sig
$ sudo pacman-key --verify binutils-2.40-2.0-i686.pkg.tar.zst.sig
==> Checking binutils-2.40-2.0-i686.pkg.tar.zst.sig... (detached)
gpg: Signature made Mon Jan 23 01:17:18 2023 EST
gpg:                using RSA key 16194A82231E9EF823562181C8E8F5A0AF9BA7E7
gpg: Good signature from "Andreas Baumann (sign) <mail@andreasbaumann.cc>" [expired]
gpg: Note: This key has expired!
Primary key fingerprint: 1619 4A82 231E 9EF8 2356  2181 C8E8 F5A0 AF9B A7E7
==> ERROR: The signature identified by binutils-2.40-2.0-i686.pkg.tar.zst.sig could not be verified.

<KitsuWhooa> fuse also fails for me

 330 PackagesBug ReportVery LowLow [gcompris-qt] no game icons Closed
100%
Task Description

gcompris-qt 3.0-1.0 is missing a dependency on llvm14 (or maybe it needs a rebuild for llvm) and thus it doesn’t show any game in the menu.

 332 PackagesBug ReportVery LowLow firefox 112 compilation Closed
100%
Task Description

any ideas hpw to get past this error (i686)?

18:33.80 /build/iceweasel/src/firefox-112.0/dom/base/nsTextFragmentGeneric.h:38:16: error: ‘any’ is not a member of ‘xsimd’
18:49.36 /build/iceweasel/src/firefox-112.0/dom/base/nsTextFragmentGeneric.h:16:70: error: incomplete type ‘xsimd::batch<short int, xsimd::sse2>’ used in nested name specifier
18:49.36 /build/iceweasel/src/firefox-112.0/dom/base/nsTextFragmentGeneric.h:35:31: error: ‘xsimd::batch<short int, xsimd::sse2> vectmask’ has incomplete type
18:49.36 /build/iceweasel/src/firefox-112.0/dom/base/nsTextFragmentGeneric.h:37:64: error: incomplete type ‘xsimd::batch<short int, xsimd::sse2>’ used in nested name specifier
 334 PackagesBug ReportVery LowLow Calibre is out of date and will not start Closed
100%
Task Description

The latest version of calibre is 6.16.

The version in the repositories is 6.11.0-1.0 and unfortunately will no longer start.

[keith@Arch32 ~]$ calibre
Failed to import PyQt module: PyQt6.QtNetwork with error: /usr/lib/python3.10/site-packages/PyQt6/QtNetwork.abi3.so: undefined symbol: _ZN16QNetworkDatagram7destroyEP23QNetworkDatagramPrivate, version Qt_6
Traceback (most recent call last):
  File "/usr/bin/calibre", line 21, in <module>
    sys.exit(calibre())
  File "/usr/lib/calibre/calibre/gui_launch.py", line 72, in calibre
    from calibre.gui2.main import main
  File "/usr/lib/calibre/calibre/gui2/__init__.py", line 13, in <module>
    from qt.core import (
ImportError: cannot import name 'QNetworkProxyFactory' from 'qt.core' (/usr/lib/calibre/qt/core.py)
[keith@Arch32 ~]$ pacman -Qi calibre
Name            : calibre
Version         : 6.11.0-1.0
Description     : Ebook management application
Architecture    : pentium4
URL             : https://calibre-ebook.com
Licenses        : GPL3
Groups          : None
Provides        : None
Depends On      : hunspell  hyphen  icu  jxrlib  libmtp  libstemmer  libusb  libwmf  mathjax  mtdev  optipng  podofo
                  python-apsw  python-beautifulsoup4  python-cchardet  python-css-parser  python-cssselect  python-dateutil
                  python-dnspython  python-feedparser  python-html2text  python-html5-parser  python-jeepney  python-lxml
                  python-markdown  python-mechanize  python-msgpack  python-netifaces  python-pdftotext  python-pillow
                  python-psutil  python-py7zr  python-pychm  python-pycryptodome  python-pygments  python-pyqt6
                  python-pyqt6-webengine  python-regex  python-unrardll  python-zeroconf  qt6-imageformats  qt6-svg
                  qt6-webengine  ttf-liberation  uchardet  udisks2
Optional Deps   : poppler: required for converting pdf to html [installed]
                  speech-dispatcher: TTS support in the viewer
Required By     : None
Optional For    : None
Conflicts With  : calibre-common  calibre-python3
Replaces        : calibre-common  calibre-python3
Installed Size  : 91.69 MiB
Packager        : Andreas Baumann <mail@andreasbaumann.cc>
Build Date      : Thu 12 Jan 2023 05:31:50 GMT
Install Date    : Tue 24 Jan 2023 10:15:48 GMT
Install Reason  : Explicitly installed
Install Script  : No
Validated By    : Signature

[keith@Arch32 ~]$ 
336PackagesBug ReportVery LowLow[pyqt-builder]: needs rebuildUnconfirmed
0%
Task Description

just wanted to get this one on the board - i am unable to build ‘python-pyqt5’ which many other packages depend on, such as ‘qutebrowser’

the current ‘python-pyqt5’ PKGBUILD, which builds fine for x86_64 and arm, has unspecified dependencies in the i686 repos - not sure why that is

ModuleNotFoundError: No module named ‘jaraco.functools’
ModuleNotFoundError: No module named ‘jaraco.context’

that is easily fixed by requiring them explicitly:
> makedepends_i686=(’python-jaraco.context’ ‘python-jaraco.functools’)

however, after that, it gives a more fatal error:

sip-build: Unable to import ‘project.py’: No module named ‘pyqtbuild’

that module is in the ‘pyqt-builder’ package, i beleive - ‘pyqt-builder’ is installed as a build dependency; but it was built for python 3.9 - so probably that is why the build could not find the module

338PackagesBug ReportVery LowLow[libreoffice-still]: error while loading shared librari...Unconfirmed
0%
Task Description

needs rebuild against latest ‘boost’

$ sudo pacman -Sy libreoffice-still

$ pacman -Qs libreoffice-still
local/libreoffice-still 7.3.7-2.0
    LibreOffice maintenance branch

$ lowriter
javaldx: Could not find a Java Runtime Environment!
Warning: failed to read path from javaldx
/usr/lib/libreoffice/program/soffice.bin: error while loading shared libraries: libboost_locale.so.1.80.0: cannot open shared object file: No such file or directory
339PackagesBug ReportVery LowLow[libcanberra-pulse]: can not be installedUnconfirmed
0%
Task Description
# pacman -S libcanberra-pulse
resolving dependencies...
warning: cannot resolve "libcanberra=0.30+2+gc0620e4-3.2", a dependency of "libcanberra-pulse"
:: The following package cannot be upgraded due to unresolvable dependencies:
      libcanberra-pulse

:: Do you want to skip the above package for this upgrade? [y/N]
error: failed to prepare transaction (could not satisfy dependencies)
:: unable to satisfy dependency 'libcanberra=0.30+2+gc0620e4-3.2' required by libcanberra-pulse
343PackagesBug ReportVery LowLowPackage 'screen 4.9.1-1.0' is missing dependency libute...Unconfirmed
0%
Task Description

Package ‘screen 4.9.1-1.0’ is missing dependency libutempter. I assume this is because libutempter used to be a dependency of util-linux which is part of base, so was assumed to be installed.

With the regular Arch Linux distro libutempter is still a dependency of util-linux.

345PackagesBug ReportVery LowLow[gcompris-qt] doesn't start due to Qt 5.15.10Unconfirmed
0%
Task Description

I fails to start with: “Cannot mix incompatible Qt library (5.15.9) with this library (5.15.10)”

346PackagesBug ReportVery LowLowpandoc: error while loading shared librariesUnconfirmed
0%
Task Description
# pacman -Syyuu base
# pacman -S pandoc
# pandoc
pandoc: error while loading shared libraries: libHSzip-archive-0.4.1-FOOm53qGfUr2AB1Oel9iH4-ghc8.10.2.so: cannot open shared object file: No such file or directory
347PackagesBug ReportVery LowLowMeld will not start - error message -> Meld requires Gt...Unconfirmed
0%
Task Description

[keith@Arch32 ~]$ meld
Meld requires Gtk+ 3.20 or higher.
[keith@Arch32 ~]$ pacman -Qi meld
Name : meld
Version : 3.22.0-2.0
Description : Compare files, directories and working copies
Architecture : any
URL : https://meldmerge.org/ Licenses : GPL Groups : None
Provides : None
Depends On : python-gobject python-cairo gtksourceview4 gsettings-desktop-schemas dconf
Optional Deps : None
Required By : None
Optional For : None
Conflicts With : None
Replaces : None
Installed Size : 5.06 MiB
Packager : TasosSah arch32@tasossah.com Build Date : Sat 19 Aug 2023 23:25:57 BST
Install Date : Sat 26 Aug 2023 07:08:59 BST
Install Reason : Explicitly installed
Install Script : No
Validated By : Signature

[keith@Arch32 ~]$ pacman -Qi gtksourceview4
Name : gtksourceview4
Version : 4.8.4-1.0
Description : A text widget adding syntax highlighting and more to GNOME
Architecture : pentium4
URL : https://wiki.gnome.org/Projects/GtkSourceView Licenses : GPL Groups : None
Provides : libgtksourceview-4.so=0-32
Depends On : gtk3 libxml2
Optional Deps : None
Required By : meld xed
Optional For : None
Conflicts With : None
Replaces : None
Installed Size : 7.44 MiB
Packager : Andreas Baumann mail@andreasbaumann.cc Build Date : Mon 07 Nov 2022 11:50:56 GMT
Install Date : Mon 28 Nov 2022 11:49:04 GMT
Install Reason : Installed as a dependency for another package
Install Script : No
Validated By : Signature

[keith@Arch32 ~]$ pacman -Qi gtk3
Name : gtk3
Version : 1:3.24.37-1.0
Description : GObject-based multi-platform GUI toolkit
Architecture : pentium4
URL : https://www.gtk.org/ Licenses : LGPL Groups : None
Provides : gtk3-print-backends libgailutil-3.so=0-32 libgdk-3.so=0-32 libgtk-3.so=0-32
Depends On : adwaita-icon-theme atk cairo cantarell-fonts dconf desktop-file-utils fontconfig fribidi gdk-pixbuf2 glib2 harfbuzz iso-codes

                libcloudproviders  libcolord  libcups  libegl  libepoxy  libgl  librsvg  libxcomposite  libx11  libxcursor  libxdamage  libxext  libxfixes
                libxi  libxinerama  libxkbcommon  libxrandr  libxrender  pango  shared-mime-info  wayland  at-spi2-core  tracker3  gtk-update-icon-cache

Optional Deps : evince: Default print preview command
Required By : bleachbit engrampa firefox gcr gpicview gspell gtkmm3 gtksourceview4 libdbusmenu-gtk3 libgnomekbd libindicator-gtk3 libnma

                libpeas  lightdm-gtk-greeter  lxmusic  vte3  xdg-user-dirs-gtk

Optional For : avahi gvfs libcanberra libdecor libreoffice-still
Conflicts With : gtk3-print-backends
Replaces : gtk3-print-backends⇐3.22.26-1
Installed Size : 49.88 MiB
Packager : Andreas Baumann mail@andreasbaumann.cc Build Date : Sun 16 Apr 2023 11:18:09 BST
Install Date : Tue 25 Apr 2023 13:06:04 BST
Install Reason : Installed as a dependency for another package
Install Script : Yes
Validated By : Signature

[keith@Arch32 ~]$

352PackagesBug ReportVery LowLowgmtp in extra is brokenUnconfirmed
0%
Task Description

It is an i686-system.

steps to reproduce:

    1) # pacman -Syyuu base
    2) # pacman -S gmtp
    3) $ gmtp

expected result:

    Start screen of gmtp appears.

actual result:

    $ gmtp
    gmtp: error while loading shared libraries: libFLAC.so.8: cannot open shared object file: No such file or directory

gmtp in extra-staging works though

 353 PackagesBug ReportVery LowLow mc: is broken Closed
100%
Task Description
$ mc
mc: symbol lookup error: mc: undefined symbol: g_string_new_take

$ mcedit
mcedit: symbol lookup error: mcedit: undefined symbol: g_string_new_take
 354 PackagesBug ReportVery LowLow staging mkinitcpio<->cryptsetup conflict Closed
100%
Task Description

it is not possible to enable staging

$ sudo pacman -Syuu
:: Synchronizing package databases...
 core-staging is up to date
 core is up to date
 extra-staging                      2.5 MiB  2.22 MiB/s 00:01 [##################################] 100%
 extra is up to date
 community-staging is up to date
 community is up to date
:: Starting full system upgrade...
resolving dependencies...
:: There are 2 providers available for dbus-units:
:: Repository core-staging
   1) dbus-broker-units  2) dbus-daemon-units

Enter a number (default=1): 
looking for conflicting packages...
:: cryptsetup and mkinitcpio are in conflict. Remove mkinitcpio? [y/N] y
error: failed to prepare transaction (could not satisfy dependencies)
:: unable to satisfy dependency 'initramfs' required by linux
359PackagesBug ReportVery LowLowQterminal 1.3.0-1.1 is brokenUnconfirmed
0%
Task Description

Qterminal 1.3.0-1.1 is broken. It causes a segmentation fault. Upgrade to 1.4.0-1.0 (still in staging) solves this issue.

342PackagesBug ReportVery LowVery Lownmap missing dependency openssl-1.1Unconfirmed
0%
Task Description

no task description

 304 PackagesBug ReportMediumCritical [systemd] 251.2 breaking systems, cannot login Closed
100%
Task Description
Assertion 'close_nointr(fd) != -EBADF' failed at src/basic/fd-util.c:76, function safe_close(). Aborting.

The temporary workaround is to comment out ‘pam_system.so’ in system-auth and system-login..

355PackagesBug ReportMediumCriticalKDE packages fail to install because of /libNew
0%
Task Description

Some KDE packages try to replace the ‘lib’ symlink with a directory, causing the system
to fail to start.

If you are lucky, pacman warns you about it and says:

pacman -S breeze-icons
resolving dependencies...
looking for conflicting packages...

Packages (1) breeze-icons-6.0.0-1.0

Total Installed Size:  71.92 MiB
Net Upgrade Size:       0.61 MiB

:: Proceed with installation? [Y/n] 
(1/1) checking keys in keyring                                  [##################################] 100%
(1/1) checking package integrity                                [##################################] 100%
(1/1) loading package files                                     [##################################] 100%
(1/1) checking for file conflicts                               [##################################] 100%
error: failed to commit transaction (conflicting files)
breeze-icons: /lib exists in filesystem (owned by filesystem)
Errors occurred, no packages were upgraded

I had one hard-to-reproduce case where I basically nuked my VMs with that.

The recovery procedure in this case is:

# Boot from last ISO
# mount /dev/xxx to /mnt
cd /usr
mv lib/cmake/* usr/lib/cmake/.
mv lib/qml /usr/lib/.
rmdir lib/cmake
rmdir lib
ln -s usr/lib lib

Packages known to misbehave are ‘kqtquickcharts’, ‘breeze-icons’. Surely more to follow..

 104 PackagesBug ReportMediumHigh [glibc] 2.31-1.0 broken Closed
100%
Task Description

Real machines (i686) break apart in mutliple ways: systemd-journald fails to start, also udev seems to have trouble. This leaves one with a rescue console. And at least in my rescue console, my keyboard did not work.
I also have a pentium4 vm which won’t boot currently (I might give some details, when I have a little more time).

 96 Packages: StableBug ReportMediumMedium [rust] broken or missing backend Closed
100%
Task Description
shell> echo > rust.rc <<EOF
fn main() {
        println!( "Hello Rust! " );
}
EOF

shell> rustc rust.rs
error: failed to find a `codegen-backends` folder in the sysroot candidates:
* /usr
* /usr

Presumably the i686 folders are moved around in PKGBUILD to form lib32
libraries for rust on 64-bit.

 177 Packages: TestingBug ReportMediumMedium [gcc] CPU ISA level is lower than required Closed
100%
Task Description

$ cc –version
cc: CPU ISA level is lower than required

The same happens in a chroot for [staging].

$ pacman -Qo /usr/bin/cc
/usr/bin/cc is owned by gcc 10.2.0-6.0

$ pacman -Q glibc
glibc 2.33-4.0

Does that mean, anything building with gcc is doomed on i686, currently?

 2 Packages: StableBug ReportMediumLow this is a test-issue for [lapack] (not a real bug) - Ar ...Closed
100%
Task Description

07.11.2017 -  FS#2  - this is a test-issue for [lapack] (not a real bug). human: ignore this build master: do not ignore this. Closed by Erich Eckner 07.11.2017 …

 3 Packages: StableBug ReportMediumLow [ffmpeg] missing FLAC codec Closed
100%
Task Description

Opened by Andreas Baumann - 07.11.2017
Last edited by Erich Eckner - 07.11.2017
 FS#3  - [ffmpeg] missing FLAC codec

Playing 10.Motion_Picture_Soundtrack.flac.
Audio only file format detected.
Load subtitles in ./

Opening audio decoder: [ffmpeg] FFmpeg/libavcodec audio decoders
[flac @ 0xb68902c0]Got unexpected packet size after a partial decode
[flac @ 0xb68902c0]Got unexpected packet size after a partial decode
[flac @ 0xb68902c0]Got unexpected packet size after a partial decode
[flac @ 0xb68902c0]Got unexpected packet size after a partial decode
[flac @ 0xb68902c0]Got unexpected packet size after a partial decode
[flac @ 0xb68902c0]Got unexpected packet size after a partial decode
ADecoder init failed sad
ADecoder init failed sad
Cannot find codec for audio format 0x43614C66.
Audio: no sound
Video: no video

Levi commented on 16.05.2019 20:08

How do I check this? I tested inputting a file to ffmpeg using the -i option and it acted like the output of ffprobe reporting things like the duration correctly before barfing that I hadn’t supplied it with any outputs. Is this fixed therefore?
Admin
Andreas Baumann commented on 17.08.2019 12:23

Output #0, flac, to ‘Kid A (2000)/10.Motion_Picture_Soundtrack.flac’:
Output file #0 does not contain any stream

and this on 64-bit.

I don’t think, flac support is there in ffmpeg

Google Cache

Bing Cache

 4 Packages: StableBug ReportMediumLow [virtualbox-guest-utils] 5.2.0 version broken  Closed
100%
Task Description

Attached to Project: Archlinux32
Opened by Andreas Baumann - 07.11.2017
Last edited by Andreas Baumann - 17.12.2017
 FS#4  - [virtualbox-guest-utils] 5.2.0 version broken

When starting a virtual machine you get:

VBoxClient: VBoxClient (seamless): failed to start. Stage: Setting guest IRQ filter mask Error: VERR_INTERNAL_ERROR

The solution is to use the guest ISO 5.2.1 for now till the package is upgraded.
Closed by Andreas Baumann
17.12.2017 20:22
Reason for closing: Fixed
Additional comments about closing:

Seems to work now. the modules load, the desktop adapts nicely. mouse works. closing this one.

Comments

Admin
Erich Eckner commented on 17.12.2017 18:46

is this still the case with 5.2.2?
Admin
Andreas Baumann commented on 17.12.2017 18:52

I’ll have to test on a virtualbox vm..

Google Cache

Bing Cache

 5 PackagesBug ReportMediumLow [sbcl] fails to compile - Arch Linux Closed
100%
Task Description

16.12.2017 - The best, I can get is trying to compile the git HEAD with clisp (instead of sbcl). However, this still errors with: entering make-target-2.sh

 6 PackagesBug ReportMediumLow [libreoffice-still] 5.3.7-4 crashes when opening a ... Closed
100%
Task Description

07.11.2017 - Nov 07 18:19:32 arch32-testing systemd[1]: Started Process Core Dump (PID 643/UID 0). Nov 07 18:19:35 arch32-testing …

 7 PackagesBug ReportMediumLow unknown bug FS#7 Closed
100%
Task Description

no task description

 8 Packages: Build-listBug ReportMediumLow [skia-sharp] [skia-sharp58] build fails Closed
100%
Task Description

Attached to Project: Archlinux32
Opened by Erich Eckner - 11.11.2017
Last edited by Andreas Baumann - 12.11.2017
 FS#8  - [skia-sharp] [skia-sharp58] build fails

/startdir/PKGBUILD: line 63: bin/gn: No such file or directory

strange about this:
- works on x86_64
- bin/gn is there and executable
Closed by Andreas Baumann
12.11.2017 14:19
Reason for closing: Won’t implement
Additional comments about closing:

blacklist, no visible 32-bit support.

Comments (7)

Admin
Andreas Baumann commented on 12.11.2017 12:29

When compiling on 64-bit I get several binaries:

src/depot_tools/gn
src/skia/gn
src/skia/buildtools/linux64/gn
src/skia/bin/gn

maybe one with linux32 is missing?
Admin
Andreas Baumann commented on 12.11.2017 12:30

Other things in PKGBUILD:

export PYTHON=’/usr/bin/pyton2’

This hardly works. :-) Admin
Andreas Baumann commented on 12.11.2017 12:31

The line with bin/gn is a little bit tricky. I’ll try to put an absolute path there..
Admin
Andreas Baumann commented on 12.11.2017 12:32

I also don’t like the ideas of pushd and popd everywhere..
Admin
Andreas Baumann commented on 12.11.2017 12:33

file bin/gn
bin/gn: ELF 64-bit LSB executable, x86-64, version 1 (SYSV), dynamically linked, interpreter /lib64/ld-linux-x86-64.so.2, for GNU/Linux 2.6.26, BuildID[sha1]=6d551c57efec95b400b9890f89a18e407396c917, stripped

So the file not found means: it exists, but has not been compiled for the correct architecture.
Admin
Andreas Baumann commented on 12.11.2017 13:57

So, removing bin/gn and calling python2 tools/git-sync-deps fetches me a new copy.
Admin
Andreas Baumann commented on 12.11.2017 14:14

So tools/git-sync-deps does:

   subprocess.check_call(
  [sys.executable,
   os.path.join(os.path.dirname(deps_file_path), 'bin', 'fetch-gn')])

which has:

gn_path = ‘buildtools/linux64/gn’ if ‘linux’ in sys.platform else \

      'buildtools/mac/gn'     if 'darwin' in sys.platform else \
      'buildtools/win/gn.exe'

fetching things from Chromium:

f.write(urllib2.urlopen('https://chromium-gn.storage-download.googleapis.com/' + sha1).read())

Changing linux64 to linux32 in a naive approach didn’t fetch a bin/gn.

So I would actually blacklist both packages.

Google Cache

 9 Packages: Build-listBug ReportMediumLow [ffmpeg] [ffmpeg2.8] libtheora not found Closed
100%
Task Description

Attached to Project: Archlinux32
Opened by Erich Eckner - 11.11.2017
Last edited by Andreas Baumann - 12.11.2017
 FS#9  - [ffmpeg] [ffmpeg2.8] libtheora not found

==&gt; Starting build()… ERROR: libtheora not found

… but it’s there:
/var/lib/archbuild/staging-i686/erich/usr/lib/libtheora.so.0.3.10
/var/lib/archbuild/staging-i686/erich/usr/lib/libtheora.so.0
/var/lib/archbuild/staging-i686/erich/usr/lib/libtheora.so

strange … Closed by Andreas Baumann
12.11.2017 15:40
Reason for closing: Fixed
Additional comments about closing:

fixed in libogg.

  Comments (5)
  Related Tasks (0/0)

Admin
Andreas Baumann commented on 12.11.2017 14:29

more ffbuild/config.log

BEGIN /tmp/ffconf.6IlfdMzU/test.c

  1   #include 
  2   #include 
  3   long check_th_info_init(void) { return (long) th_info_init; }
  4   int main(void) { int ret = 0;
  5    ret |= ((intptr_t)check_th_info_init) &amp; 0xFFFF;
  6   return ret; }

END /tmp/ffconf.6IlfdMzU/test.c
gcc -D_ISOC99_SOURCE -D_FILE_OFFSET_BITS=64 -D_LARGEFILE_SOURCE -D_POSIX_C_SOURCE=200112 -D_XOPEN_SOURCE=
600 -DPIC -std=c11 -fomit-frame-pointer -fPIC -pthread -I/usr/include/p11-kit-1 -I/usr/include/freetype2
-I/usr/include/libpng16 -I/usr/include/harfbuzz -I/usr/include/glib-2.0 -I/usr/lib/glib-2.0/include -I/us
r/include/fribidi -I/usr/include/freetype2 -I/usr/include/libpng16 -I/usr/include/harfbuzz -I/usr/include
/glib-2.0 -I/usr/lib/glib-2.0/include -I/usr/include/freetype2 -I/usr/include/libpng16 -I/usr/include/har
/
…skipping
In file included from /usr/include/ogg/os_types.h:144:0,

               from /usr/include/ogg/ogg.h:25,
               from /usr/include/theora/theoraenc.h:24,
               from /tmp/ffconf.6IlfdMzU/test.c:1:

/usr/include/ogg/config_types.h:4:10: fatal error: config_types-32.h: No such file or directory
#include “config_types-32.h”

        ^~~~~~~~~~~~~~~~~~~

compilation terminated.
ERROR: libtheora not found

Admin
Andreas Baumann commented on 12.11.2017 14:31

/usr/include/ogg/config_types.h

#if WORDSIZE == 32
#include “config_types-32.h” #elif
WORDSIZE == 64
#include “config_types-64.h” #else
#error “Unknown word size” #endif

ls /usr/include/ogg/
config_types-64.h config_types.h ogg.h os_types.h

So ogg misses the 32-bit types header file.. I’ll check there..
Admin
Andreas Baumann commented on 12.11.2017 14:54

Trying a patch in libogg:

sed

  s|mv "${pkgdir}"/usr/include/ogg/config_types{,-64}.h|mv "${pkgdir}"/usr/include/ogg/config_types{,-32}.h|

Admin
Andreas Baumann commented on 12.11.2017 14:57

acutally: better remove the whole multilib stuff on 32-bit..
Admin
Andreas Baumann commented on 12.11.2017 15:39

eval “$(

declare -f package | \
  sed '
    /^.*Resolve multilib conflict/,/^}$/{//p;d;}
  '

)”

Back to first version, I’m not a sed-king (rather the very opposite).

Google Cache

 10 PackagesBug ReportMediumLow unknown bug FS#10 Closed
100%
Task Description

no task description

 11 PackagesBug ReportMediumLow unknown bug FS#11 Closed
100%
Task Description

no task description

 12 Packages: Build-listBug ReportMediumLow [python-setuptools] check() fails (due to some mpmath i ...Closed
100%
Task Description

Attached to Project: Archlinux32
Opened by Erich Eckner - 15.11.2017
Last edited by Andreas Baumann - 02.10.2019
 FS#12  - [python-setuptools] check() fails (due to some mpmath issue?)

during check():
_ sympy/polys/tests/test_rootoftools.py:test_CRootOf_evalf _

File “/build/python-sympy/src/sympy-sympy-1.1.1-py2/sympy/polys/tests/test_rootoftools.py”, line 225, in test_CRootOf_evalf

a, b = rootof(eq, 1).n(2).as_real_imag()

File “sympy/core/evalf.py”, line 1394, in evalf

result = evalf(self, prec + 4, options)

File “sympy/core/evalf.py”, line 1292, in evalf

xe = x._eval_evalf(prec)

File “sympy/polys/rootoftools.py”, line 644, in _eval_evalf

x0 = mpc(*map(str, interval.center))

File “/usr/lib/python2.7/site-packages/mpmath/ctx_mp_python.py”, line 374, in new

imag = cls.context.mpf(imag)

File “/usr/lib/python2.7/site-packages/mpmath/ctx_mp_python.py”, line 77, in new

v._mpf_ = mpf_pos(cls.mpf_convert_arg(val, prec, rounding), prec, rounding)

File “/usr/lib/python2.7/site-packages/mpmath/ctx_mp_python.py”, line 84, in mpf_convert_arg

if isinstance(x, basestring): return from_str(x, prec, rounding)

File “/usr/lib/python2.7/site-packages/mpmath/libmp/libmpf.py”, line 1300, in from_str

return from_rational(int(p), int(q), prec, rnd)

ValueError: invalid literal for int() with base 10: ‘-2163048125L’
tests finished: 6841 passed, 185 skipped, 1 exceptions, in 4352.49 seconds

DO *NOT* COMMIT!
test process starts

executable: /usr/bin/python2 (2.7.14-final-0) [CPython]
architecture: 32-bit
cache: yes
ground types: gmpy 2.0.8
hash randomization: on (PYTHONHASHSEED=3003103148)
Closed by Andreas Baumann
02.10.2019 19:15
Reason for closing: Fixed
Additional comments about closing:

Seems to run the tests just fine on i686 and pentium4.

Google Cache

Bing Cache

 13 PackagesBug ReportMediumLow [fox-devel] fails on 32-bit Intel - Arch Linux Closed
100%
Task Description

16.11.2017 - It’s the development version of the FOX toolkit. Breaks in some int/FXival/void * abstractions: FXWSQueue.cpp: In member function ‘FX::FXbool …

 14 PackagesBug ReportMediumLow [ghc-mod] Needs rebuilt Closed
100%
Task Description

Attached to Project: Archlinux32
Opened by Luke Shumaker - 21.11.2017
Last edited by Erich Eckner - 25.11.2017
 FS#14  - [ghc-mod] Needs rebuilt

Yesterday, I mentioned on IRC that many haskell packages need rebuilt. In response, deep42thought moved a bunch of packages from staging to stable, and told me to open a bug report if the issue persisted.

For the most part, this seems resolved. Some pacman -Qo/-Ql/ldd/grep magic tells me that all of the haskell packages I have are fine, except for [ghc-mod].
Closed by Erich Eckner
25.11.2017 14:58
Reason for closing: Fixed
Additional comments about closing:

removed - upstream removed it, too

  Comments (1)
  Related Tasks (0/0)

Luke Shumaker commented on 23.11.2017 04:47

deep42thought has removed ghc-mod, reflecting its removal in Arch. Requesting closure.

Google Cache

 15 Packages: StableBug ReportMediumLow [extra/m17n-lib] needs rebuilt for icu 60 Closed
100%
Task Description

Attached to Project: Archlinux32
Opened by Luke Shumaker - 22.11.2017
Last edited by Erich Eckner - 28.11.2017
 FS#15  - [extra/m17n-lib] needs rebuilt for icu 60

extra/m17n-lib 1.7.0-1 is built against icu 59; it needs rebuilt against icu 60 (which moved from staging to stable on Monday).
Closed by Erich Eckner
28.11.2017 08:14
Reason for closing: Fixed
Additional comments about closing:

unfortunately, the fixed package has same version - so you need to force update that one.

  Comments (1)
  Related Tasks (0/0)

Admin
Andreas Baumann commented on 23.11.2017 09:55

I checked on stable, seems ok to me now:

ldd /usr/lib/libm17n.so.0.4.1

    linux-gate.so.1 (0xb7f9c000)
    libm17n-core.so.0 =&gt; /usr/lib/libm17n-core.so.0 (0xb7f12000)
    libdl.so.2 =&gt; /usr/lib/libdl.so.2 (0xb7f0d000)
    libc.so.6 =&gt; /usr/lib/libc.so.6 (0xb7d37000)
    libxml2.so.2 =&gt; /usr/lib/libxml2.so.2 (0xb7bb7000)
    libz.so.1 =&gt; /usr/lib/libz.so.1 (0xb7b9e000)
    liblzma.so.5 =&gt; /usr/lib/liblzma.so.5 (0xb7b72000)
    libicui18n.so.60 =&gt; /usr/lib/libicui18n.so.60 (0xb78bc000)
    libicuuc.so.60 =&gt; /usr/lib/libicuuc.so.60 (0xb7702000)
    libicudata.so.60 =&gt; /usr/lib/libicudata.so.60 (0xb5d6c000)
    libm.so.6 =&gt; /usr/lib/libm.so.6 (0xb5c70000)
    /usr/lib/ld-linux.so.2 (0xb7f9e000)
    libpthread.so.0 =&gt; /usr/lib/libpthread.so.0 (0xb5c4f000)
    libstdc++.so.6 =&gt; /usr/lib/libstdc++.so.6 (0xb5ad5000)
    libgcc_s.so.1 =&gt; /usr/lib/libgcc_s.so.1 (0xb5ab8000)

Google Cache

Showing tasks 101 - 150 of 350 Page 3 of 7 - 1 - 2 - 3 - 4 - 5 - Last >>

Available keyboard shortcuts

Tasklist

Task Details

Task Editing