Bugs in Archlinux32 packages, specific to 32-bit issues.

Bugs  FS#2  to  FS#92  have been recovered and may be incomplete, the
recovered Google/Bing cache data can be found here.

IDCategory  ascTask TypePrioritySeveritySummaryStatusProgress
 212 PackagesBug ReportVery LowHigh libblockdev issue with glibc Closed
100%
Task Description

Trying to start udisks2 daemon (systemctl start udisks2.service) fails because of a library issue.

/usr/lib/udisks2/udisksd: symbol lookup error: /usr/lib/libbd_utils.so.2: undefined symbol: g_spawn_check_wait_status

Maybe libblockdev needs to be recompiled with the right glibc version.

Thus, it is not possible to auto-mount external USB drives.

 133 PackagesBug ReportMediumLow libao and libpulse mixup Closed
100%
Task Description
resolving dependencies...
warning: cannot resolve "libpulse.so=0-32", a dependency of "libao"
warning: cannot resolve "libpulse-simple.so=0-32", a dependency of "libao"
:: The following package cannot be upgraded due to unresolvable dependencies:
      libao

:: Do you want to skip the above package for this upgrade? [y/N] n
error: failed to prepare transaction (could not satisfy dependencies)
:: unable to satisfy dependency 'libpulse.so=0-32' required by libao
:: unable to satisfy dependency 'libpulse-simple.so=0-32' required by libao
 30 PackagesBug ReportMediumLow libaio, will fail with stack smash protection enabled . ...Closed
100%
Task Description

12.04.2018 - io_queue_run.os: In function `io_queue_run’: io_queue_run.c:(.text+0×71): undefined reference to `__stack_chk_fail_local’ io_getevents.os: In …

 147 PackagesBug ReportMediumLow kpgp fails at startup Closed
100%
Task Description
Feb 12 11:57:48 arch32-testing-pentium4 audit[9829]: USER_LOGIN pid=9829 uid=0 auid=1000 ses=7 msg='op=login id=1000 exe="/usr/bin/lightdm" hostname=arch32-testing-pentium4 addr=? terminal=/dev/tty7 res=success'
Feb 12 11:57:48 arch32-testing-pentium4 kernel: audit: type=1112 audit(1613127468.816:104): pid=9829 uid=0 auid=1000 ses=7 msg='op=login id=1000 exe="/usr/bin/lightdm" hostname=arch32-testing-pentium4 addr=? terminal=/dev/tty7 res=success'
Feb 12 11:57:55 arch32-testing-pentium4 kaccess[9880]: Xlib XKB extension major= 1  minor= 0
Feb 12 11:57:56 arch32-testing-pentium4 kaccess[9880]: QStandardPaths: XDG_RUNTIME_DIR not set, defaulting to '/tmp/runtime-guest'
Feb 12 11:57:58 arch32-testing-pentium4 kaccess[9880]: "Session bus not found\nTo circumvent this problem try the following command (with Linux and bash)\nexport $(dbus-launch)"
Feb 12 11:58:00 arch32-testing-pentium4 kgpg[9909]: QStandardPaths: XDG_RUNTIME_DIR not set, defaulting to '/tmp/runtime-guest'
Feb 12 11:58:01 arch32-testing-pentium4 kgpg[9909]: QStandardPaths: XDG_RUNTIME_DIR not set, defaulting to '/tmp/runtime-guest'
Feb 12 11:58:01 arch32-testing-pentium4 kgpg[9909]: QStandardPaths: XDG_RUNTIME_DIR not set, defaulting to '/tmp/runtime-guest'
Feb 12 11:58:01 arch32-testing-pentium4 kgpg[9909]: "Session bus not found\nTo circumvent this problem try the following command (with Linux and bash)\nexport $(dbus-launch)"

 160 PackagesBug ReportMediumLow konqueror fails to work Closed
100%
Task Description

re.so.8 error messages, re.so.9 is in stable

and then segfaults in libQt5WebEngineCore

210PackagesBug ReportVery LowMediumkeymap don't gets fixed on login as set in /etc/vconsol...Unconfirmed
0%
Task Description

gzip comes with asm code, if enabled, built a TEXTREL which gets bloqued on boot, so systemd don’t set keymap
A lot of tricks in forums, old thread more complete here $506 An old problem. Work around while asm gets fixed is call configure with DEFS=”NO_ASM” like this:

...
export DEFS="NO_ASM"
./configure ....

or,

./configure DEFS="NO_ASM" ....

I have not tested it, but gentoo on x32 have gzip like this and no TEXTRELS here.
No matter i486, i686 or pentium.

Hope it helps.

Best regards.

355PackagesBug ReportMediumCriticalKDE packages fail to install because of /libNew
0%
Task Description

Some KDE packages try to replace the ‘lib’ symlink with a directory, causing the system
to fail to start.

If you are lucky, pacman warns you about it and says:

pacman -S breeze-icons
resolving dependencies...
looking for conflicting packages...

Packages (1) breeze-icons-6.0.0-1.0

Total Installed Size:  71.92 MiB
Net Upgrade Size:       0.61 MiB

:: Proceed with installation? [Y/n] 
(1/1) checking keys in keyring                                  [##################################] 100%
(1/1) checking package integrity                                [##################################] 100%
(1/1) loading package files                                     [##################################] 100%
(1/1) checking for file conflicts                               [##################################] 100%
error: failed to commit transaction (conflicting files)
breeze-icons: /lib exists in filesystem (owned by filesystem)
Errors occurred, no packages were upgraded

I had one hard-to-reproduce case where I basically nuked my VMs with that.

The recovery procedure in this case is:

# Boot from last ISO
# mount /dev/xxx to /mnt
cd /usr
mv lib/cmake/* usr/lib/cmake/.
mv lib/qml /usr/lib/.
rmdir lib/cmake
rmdir lib
ln -s usr/lib lib

Packages known to misbehave are ‘kqtquickcharts’, ‘breeze-icons’. Surely more to follow..

 297 PackagesBug ReportVery LowLow jack2 can not install Closed
100%
Task Description
# pacman -S jack --noconfirm
:: There are 2 providers available for jack:
:: Repository extra
   1) jack2  2) pipewire-jack

Enter a number (default=1): 
resolving dependencies...
warning: cannot resolve "libcelt0.so=2-32", a dependency of "jack2"
:: The following package cannot be upgraded due to unresolvable dependencies:
      jack2

:: Do you want to skip the above package for this upgrade? [y/N] error: failed to prepare transaction (could not satisfy dependencies)

:: unable to satisfy dependency 'libcelt0.so=2-32' required by jack2
172PackagesBug ReportVery LowMediumiwd requires some kernel flagsUnconfirmed
0%
Task Description

RC4 support not found
The following options are missing in the kernel:

CONFIG_CRYPTO_USER_API_SKCIPHER
CONFIG_CRYPTO_ECB
CONFIG_CRYPTO_ARC4
 37 PackagesBug ReportMediumLow ISO 2018.05.01 is not bootable with qemu or Virtualbox Closed
100%
Task Description

Attached to Project: Archlinux32
Opened by Andreas Baumann - 10.05.2018
Last edited by Andreas Baumann - 23.01.2019
 FS#37  - ISO 2018.05.01 is not bootable with qemu or Virtualbox

I tried the i686 image. Booting leads to kernel panic.
Adding an explicit init=/lib/systemd/systemd parameter also panics.

qemu-system-i386 -cdrom archlinux-2018.05.01-i686.iso

It also panics in Virtualbox.

The same ISO works with libvirtd though.
Closed by Andreas Baumann
23.01.2019 18:29
Reason for closing: Fixed
Additional comments about closing:

works

  Comments (6)
  Related Tasks (0/0)

Admin
Tyzoid commented on 10.05.2018 10:49

i686 iso works fine in virtualbox on both a windows and linux host from my testing.
Admin
Tyzoid commented on 10.05.2018 11:04

Issue confirmed on qemu-system-i386 and qemu-system-x86_64. archlinux-2018.04.01-i686.iso fails to boot correctly as well.

Screenshot of the issue on i386 qemu: https://i.imgur.com/KRt21gI.png Screenshot of the issue on x86_64 qemu: https://i.imgur.com/wozM2hb.png Admin
Andreas Baumann commented on 11.05.2018 09:02

So /lib/systemd/systemd is either not found or cannot be executed, maybe because of a wrong
shared library dependency? I doubt it has to do with the kernel itself, as the log message
indicates the initial ram disk has been loaded.
Admin
Andreas Baumann commented on 16.06.2018 18:35

The write error indicates that the ramdisk could not be extracted.

So, if I start qemu with:

qemu-system-i386 -enable-kvm -cpu pentium3 -m 2048 -cdrom archlinux-2018.06.01-i686.iso

it works.

The default in qemu is 128MB :-) Admin
Andreas Baumann commented on 16.06.2018 18:48

Sadly this is not the cause for VirtualBox, there it still fails even with 2048MB memory.
Admin
Andreas Baumann commented on 23.01.2019 18:18

The 2019.01.04 ISO works with Virtualbox 6.0.0.

Google Cache

 127 PackagesBug ReportMediumLow iotop doesn't work Closed
100%
Task Description
root@arch32-stable-pentium4 ~]# iotop
No module named 'iotop'
To run an uninstalled copy of iotop,
launch iotop.py in the top directory

iotop is a Python script, presumably some Python modules are missing.

209PackagesBug ReportVery LowLowIntel High Definition Audio issue.Unconfirmed
0%
Task Description

I am using Arch Linux 32 latest version on Sony VAIO VGN-FS215Z . The following is the audio device:

-fs215z:~$ lspci | grep -i audio

00:1b.0 Audio device: Intel Corporation 82801FB/FBM/FR/FW/FRW (ICH6 Family) High Definition Audio Controller (rev 03)

When I boot the system after some time getting crackling sound in speaker. Sometimes it stops after few minutes and sometimes continue to sound. Really annoying. I am not getting the normal audio in any application. This problem was there in debian based OSs also but not there in any other OS.

Please help.

 312 PackagesBug ReportVery LowLow In testing calibre will not start Closed
100%
Task Description
[keith@Arch32 ~]$ calibre
Failed to import PyQt module: PyQt6.QtQuick with error: No module named 'PyQt6.QtQuick'
Traceback (most recent call last):
  File "/usr/bin/calibre", line 21, in <module>
    sys.exit(calibre())
  File "/usr/lib/calibre/calibre/gui_launch.py", line 73, in calibre
    main(args)
  File "/usr/lib/calibre/calibre/gui2/main.py", line 546, in main
    app, opts, args = init_qt(args)
  File "/usr/lib/calibre/calibre/gui2/main.py", line 123, in init_qt
    app = Application(args, override_program_name=override, windows_app_uid=MAIN_APP_UID)
  File "/usr/lib/calibre/calibre/gui2/__init__.py", line 1096, in __init__
    setup_to_run_webengine()
  File "/usr/lib/calibre/calibre/gui2/__init__.py", line 1078, in setup_to_run_webengine
    from qt.core import QQuickWindow, QSGRendererInterface
ImportError: cannot import name 'QQuickWindow' from 'qt.core' (/usr/lib/calibre/qt/core.py)
[keith@Arch32 ~]$ calibre --version
calibre (calibre 6.7.1)
[keith@Arch32 ~]$ 
 237 PackagesBug ReportVery LowLow i686: pango need to be rebuilt against harfbuzz Closed
100%
Task Description

Hi,

pango-list (and many packages depending on pango) fails to run with the following error:

$ pango-list 
pango-list: symbol lookup error: /usr/lib/libpangoft2-1.0.so.0: undefined symbol: hb_font_set_synthetic_slant

hb_font_set_synthetic_slant seems to be related to harfbuzz.

While I used Parabola i686 for the test, both pango and harfbuzz come from Arch Linux 32 i686, so Arch Linux 32 i686 should also be affected:

$ pacman -Q -o pango-list 
/usr/bin/pango-list is owned by pango 1:1.50.4-1.0
$ pacman -sS "^pango$"
extra/pango 1:1.50.4-1.0 [installed]
    A library for layout and rendering of text
$ pacman -sS "^harfbuzz$"
extra/harfbuzz 3.1.2-1.0 [installed]
    OpenType text shaping engine

Denis.

 291 PackagesFeature RequestVery LowLow Hey , if possible can u build temite based on https://g ...Closed
100%
Task Description

Note:- It will compile very easily as i have a modified PKGBUILD

```
# Maintainer: Frederik Schwan freswa@archlinux.org pkgdesc=’A simple VTE-based terminal’ pkgname=termite
pkgver=16.4
pkgrel=2
url=https://github.com/aperezdc/termite license=(LGPL)
depends=(gtk3 pcre2 gnutls vte-common)
makedepends=(gperf ‘meson>=0.58’ ninja)
arch=(’x86_64’,’i686’,’pentium4’‘i486’)
backup=(etc/xdg/termite/config)

source=(”${url}/releases/download/v${pkgver}/termite-${pkgver}.tar.xz”{,.asc})
b2sums=(’SKIP’

      'SKIP')

build () {

rm -rf _build
arch-meson _build "${pkgname}-${pkgver}"
meson compile -C _build

}

package () {

meson install -C _build --skip-subprojects vte --destdir "${pkgdir}"

}
```

 292 PackagesFeature RequestVery LowLow Hey , if possible can u build temite based on https://g ...Closed
100%
Task Description

Note:- It will compile very easily as i have a modified PKGBUILD

# Maintainer: Frederik Schwan freswa@archlinux.org pkgdesc=’A simple VTE-based terminal’ pkgname=termite
pkgver=16.4
pkgrel=2
url=https://github.com/aperezdc/termite license=(LGPL)
depends=(gtk3 pcre2 gnutls vte-common)
makedepends=(gperf ‘meson>=0.58’ ninja)
arch=(’x86_64’,’i686’,’pentium4’‘i486’)
backup=(etc/xdg/termite/config)

source=(”${url}/releases/download/v${pkgver}/termite-${pkgver}.tar.xz”{,.asc})
b2sums=(’SKIP’

      'SKIP')

build () {

rm -rf _build
arch-meson _build "${pkgname}-${pkgver}"
meson compile -C _build

}

package () {

meson install -C _build --skip-subprojects vte --destdir "${pkgdir}"

}

 136 PackagesBug ReportMediumLow Haskell probably completely fails to rebuild Closed
100%
Task Description
Configuring attoparsec-0.13.2.4...
Error:
    The following packages are broken because other packages they depend on are missing. These broken packages must be rebuilt before they can be used.
installed package tasty-1.3.1 is broken due to missing package ansi-terminal-0.11-2SXi8ZhU18i2uWLidRUotS, async-2.2.2-K8T9LglWxlG5HgD5vvGjbo, optparse-applicative-0.16.1.0-JDPEASK1GJS1Nsq2qjjZCq
installed package tasty-quickcheck-0.10.1.2 is broken due to missing package QuickCheck-2.14.2-io0WylueSG4seqSTUQCKM, optparse-applicative-0.16
 224 PackagesBug ReportVery LowCritical gpg broken on pentium4 Closed
100%
Task Description

I had to rebuild sqlite to have dirmng start and still –recv-keys is not working, returning “general error”.

 194 PackagesBug ReportVery LowLow go 1.16 doesn't build. Closed
100%
Task Description

The go build fails with this error:

unsupported setting GO386=387. Consider using GO386=softfloat instead.

go tool dist: FAILED: /build/go/src/go/pkg/tool/linux_386/compile -std -pack -o /tmp/go-tool-dist-250139381/runtime/internal/atomic/_go_.a -p runtime/internal/atomic -importcfg /tmp/go-tool-dist-250139381/runtime/internal/atomic/importcfg -asmhdr /tmp/go-tool-dist-250139381/runtime/internal/atomic/go_asm.h -symabis /tmp/go-tool-dist-250139381/runtime/internal/atomic/symabis /build/go/src/go/src/runtime/internal/atomic/atomic_386.go /build/go/src/go/src/runtime/internal/atomic/stubs.go /build/go/src/go/src/runtime/internal/atomic/unaligned.go: exit status 1
go tool dist: open /tmp/go-tool-dist-250139381/runtime/internal/atomic/_go_.a: no such file or directory
go tool dist: open /tmp/go-tool-dist-250139381/runtime/internal/sys/_go_.a: no such file or directory
go tool dist: open /tmp/go-tool-dist-250139381/internal/cpu/_go_.a: no such file or directory
unsupported setting GO386=387. Consider using GO386=softfloat instead.

go tool dist: FAILED: /build/go/src/go/pkg/tool/linux_386/compile -std -pack -o /tmp/go-tool-dist-250139381/internal/cpu/_go_.a -p internal/cpu -importcfg /tmp/go-tool-dist-250139381/internal/cpu/importcfg -asmhdr /tmp/go-tool-dist-250139381/internal/cpu/go_asm.h -symabis /tmp/go-tool-dist-250139381/internal/cpu/symabis /build/go/src/go/src/internal/cpu/cpu.go /build/go/src/go/src/internal/cpu/cpu_386.go /build/go/src/go/src/internal/cpu/cpu_x86.go: exit status 1
unsupported setting GO386=387. Consider using GO386=softfloat instead.

go tool dist: FAILED: /build/go/src/go/pkg/tool/linux_386/compile -std -pack -o /tmp/go-tool-dist-250139381/runtime/internal/sys/_go_.a -p runtime/internal/sys -importcfg /tmp/go-tool-dist-250139381/runtime/internal/sys/importcfg -asmhdr /tmp/go-tool-dist-250139381/runtime/internal/sys/go_asm.h -symabis /tmp/go-tool-dist-250139381/runtime/internal/sys/symabis /build/go/src/go/src/runtime/internal/sys/arch.go /build/go/src/go/src/runtime/internal/sys/arch_386.go /build/go/src/go/src/runtime/internal/sys/intrinsics_common.go /build/go/src/go/src/runtime/internal/sys/intrinsics_stubs.go /build/go/src/go/src/runtime/internal/sys/stubs.go /build/go/src/go/src/runtime/internal/sys/sys.go /build/go/src/go/src/runtime/internal/sys/zgoarch_386.go /build/go/src/go/src/runtime/internal/sys/zgoos_linux.go /build/go/src/go/src/runtime/internal/sys/zversion.go: exit status 1
=⇒ ERROR: A failure occurred in build().

  Aborting...

Upstream discussion about this bug: https://github.com/golang/go/issues/44500

Someone mentions a fix, but it doesn’t apply for non SSE2 devices.

 142 PackagesBug ReportMediumLow gnome-terminal doesn't start Closed
100%
Task Description
# Error constructing proxy for org.gnome.Terminal:/org/gnome/Terminal/Factory0: Could not connect: Connection refused

As this is the case since months, I cannot imagine somebody is still using Gnome on Archlinux32..

 157 PackagesBug ReportMediumLow gnome-control-center and epiphany don't start due to un ...Closed
100%
Task Description

Feb 19 10:22:46 arch32-stable-pentium4 gnome-control-center.desktop[10992]: gnome-control-center: symbol lookup error: /usr/lib/libwebkit2gtk-4.0.so.37: undefined symbol: wpe_fdo_initialize_shm

 115 PackagesBug ReportMediumLow gnome doesn't start Closed
100%
Task Description

gnome-shell segfaults in libmutter.

                                                               Stack trace of thread 1009:
                                                               #0  0x00000000b64d5436 n/a (libmutter-cogl-6.so.0 + 0xe436)
                                                               #1  0x00000000b64d809c n/a (libmutter-cogl-6.so.0 + 0x1109c)
                                                               #2  0x00000000b653edb9 n/a (libmutter-cogl-6.so.0 + 0x77db9)
                                                               #3  0x00000000b64f8fc5 cogl_flush (libmutter-cogl-6.so.0 + 0x31fc5)
                                                               #4  0x00000000b6549154 cogl_onscreen_swap_buffers_with_damage (libmutter-cogl-6.so.0 + 0x82154)
                                                               #5  0x00000000b6c59f73 n/a (libmutter-clutter-6.so.0 + 0x10ff73)
                                                               #6  0x00000000b6c53cf2 n/a (libmutter-clutter-6.so.0 + 0x109cf2)
                                                               #7  0x00000000b6c54747 n/a (libmutter-clutter-6.so.0 + 0x10a747)
                                                               #8  0x00000000b6bf52ad n/a (libmutter-clutter-6.so.0 + 0xab2ad)
                                                               #9  0x00000000b7703bde g_main_context_dispatch (libglib-2.0.so.0 + 0x4dbde)
                                                               #10 0x00000000b7752962 n/a (libglib-2.0.so.0 + 0x9c962)
                                                               #11 0x00000000b7702299 g_main_loop_run (libglib-2.0.so.0 + 0x4c299)
                                                               #12 0x00000000b697f216 meta_run (libmutter-6.so.0 + 0xb9216)
                                                               #13 0x000000000043144e n/a (gnome-shell + 0x244e)
                                                               #14 0x00000000b7cd900e __libc_start_main (libc.so.6 + 0x1f00e)
                                                               #15 0x0000000000431635 n/a (gnome-shell + 0x2635)
 151 PackagesBug ReportMediumLow Gnome cannot be installed Closed
100%
Task Description

:: installing mutter (3.38.3-1.0) breaks dependency ‘libmutter-6.so=0-32’ required by gnome-shell

let’s try to push mutter, making most of gnome happy, most likely breaking gnome-shell (if not
already broken).

 222 PackagesBug ReportVery LowLow GNOME broken on pentium4 Closed
100%
Task Description

I’m getting a “BadAccess” Xorg error. I think this is happening because the packaged version has been compiled against libraries which have meanwhile been upgraded.

Just to get to this point I had to install “libldap24” and “libffi7”.

352PackagesBug ReportVery LowLowgmtp in extra is brokenUnconfirmed
0%
Task Description

It is an i686-system.

steps to reproduce:

    1) # pacman -Syyuu base
    2) # pacman -S gmtp
    3) $ gmtp

expected result:

    Start screen of gmtp appears.

actual result:

    $ gmtp
    gmtp: error while loading shared libraries: libFLAC.so.8: cannot open shared object file: No such file or directory

gmtp in extra-staging works though

 145 PackagesBug ReportMediumLow glibc 2.33 breaks i686 and i486 architectures Closed
100%
Task Description
/usr/lib/libc.6: CPU ISA level is lower than required.

updating effectively breaks all commands!

For those lucky enough to have a pacman-static installed, they can
IMMEDIATEDY downgrade glibc and keep the machine alive.

This is considered a distribution-killing bug for i486 and i686.

Pentium4 is not affectted.

 308 PackagesBug ReportVery LowLow gettext needs a rebuild for libunistring Closed
100%
Task Description

I’m on pentium4 and I’m getting:

/usr/bin/xgettext: error while loading shared libraries: libunistring.so.2: cannot open shared object file: No such file or directory
/usr/bin/msgmerge: error while loading shared libraries: libunistring.so.2: cannot open shared object file: No such file or directory
/usr/bin/msgfmt: error while loading shared libraries: libunistring.so.2: cannot open shared object file: No such file or directory

gettext 0.21.1-1.1
libunistring 1.1-2.0

 154 PackagesBug ReportMediumLow gedit fails to start Closed
100%
Task Description

gedit: error while loading shared libraries: libtepl-5.so.0: cannot open shared object file: No such file or directory

 204 PackagesBug ReportMediumLow gdbm 1.21 fails in test 31 (convert new database format ...Closed
100%
Task Description

The bug report has been sent upstream to GDBM directly. This is too important to just ignore the failure.. (make check || true)

 236 PackagesBug ReportVery LowLow gdb: error while loading shared libraries: libboost_reg ...Closed
100%
Task Description

Current version in /usr/lib is libboost_regex.so.1.78.0

 309 PackagesBug ReportVery LowLow gcompris links to openssl-1.1.so Closed
100%
Task Description

```
gcompris-qt: error while loading shared libraries: libssl.so.1.1: cannot open shared object file: No such file or directory
```

109PackagesBug ReportMediumLowgcc10 -fno-common breaks jdkNew
0%
Task Description

/usr/bin/ld: /build/java-openjdk/src/jdk14u-jdk-14.0.1+7/build/linux-x86-server-release/support/native/java.base/libjava/childproc.o:/build/java-openjdk/src/jdk14u-jdk-14.0.1+7/src/java.base/unix/native/libjava/childproc.h:129: multiple definition of `parentPathv’; /build/java-openjdk/src/jdk14u-jdk-14.0.1+7/build/linux-x86-server-release/support/native/java.base/libjava/ProcessImpl_md.o:/build/java-openjdk/src/jdk14u-jdk-14.0.1+7/src/java.base/unix/native/libjava/childproc.h:129: first defined here

collect2: error: ld returned 1 exit status

This is fixed known and fixed upstream (without just setting
-fcommon again):

https://bugs.openjdk.java.net/browse/JDK-8235903

 235 PackagesBug ReportVery LowLow fluxbox segfaults Closed
100%
Task Description

no task description

 296 PackagesBug ReportVery LowLow Fix terminal emulators  Closed
100%
Task Description

On arch32 currently foot and alacritty is broken

 144 PackagesBug ReportMediumLow firefox fails to build Closed
100%
Task Description
/build/seamonkey/src/seamonkey-2.53.5/obj-i686-pc-linux-gnu/_virtualenv/bin/python /build/seamonkey/src/s                                                                                                           eamonkey-2.53.5/mozilla/toolkit/mozapps/installer/packager.py -DMOZ_APP_NAME=seamonkey -DPREF_DIR=default                                                                                                           s/pref -DJAREXT= -DMOZ_CALENDAR=1 -DMOZ_GTK=1 -DMOZ_IRC=1 -DMOZ_DOMINSPECTOR=1 -DMOZ_SYSTEM_NSPR=1 -DMOZ_                                                                                                           SYSTEM_NSS=1 -DMOZ_MOVEMAIL=1 -DNECKO_WIFI=1 -DMOZ_BUNDLED_FONTS=1 -DMOZ_CHILD_PROCESS_NAME=plugin-contai                                                                                                           ner -DDLL_PREFIX=lib -DDLL_SUFFIX=.so -DBIN_SUFFIX= -DDIR_MACOS= -DDIR_RESOURCES= -DBINPATH=bin -DRESPATH                                                                                                           =bin -DLPROJ_ROOT=en -DCLANG_CXX -DA11Y_LOG=1 -DACCESSIBILITY=1 -DATK_MAJOR_VERSION=2 -DATK_MINOR_VERSION                                                                                                           =36 -DATK_REV_VERSION=0 -DBUILD_CTYPES=1 -DCROSS_COMPILE='' -DD_INO=d_ino -DENABLE_INTL_API=1 -DENABLE_SY                                                                                                           STEM_EXTENSION_DIRS=1 -DEXPOSE_INTL_API=1 -DFIREFOX_VERSION=60.7.5 -DFORCE_PR_LOG=1 -DFUNCPROTO=15 -DGDK_                                                                                                           VERSION_MAX_ALLOWED=GDK_VERSION_3_4 -DGLIB_VERSION_MAX_ALLOWED=GLIB_VERSION_2_32 -DGLIB_VERSION_MIN_REQUIRED=GLIB_VERSION_2_26 -DGL_PROVIDER_GLX=1 -DHAVE_ALLOCA_H=1 -DHAVE_BYTESWAP_H=1 -DHAVE_CLOCK_MONOTONIC=1 -DHAVE_CPUID_H=1 -DHAVE_DIRENT_H=1 -DHAVE_DLADDR=1 -DHAVE_DLOPEN=1 -DHAVE_FONTCONFIG_FCFREETYPE_H=1 -DHAVE_FT_BITMAP_SIZE_Y_PPEM=1 -DHAVE_FT_GLYPHSLOT_EMBOLDEN=1 -DHAVE_FT_LOAD_SFNT_TABLE=1 -DHAVE_GETOPT_H=1 -DHAVE_GETTID=1 -DHAVE_GMTIME_R=1 -DHAVE_I18N_LC_MESSAGES=1 -DHAVE_INTTYPES_H=1 -DHAVE_LCHOWN=1 -DHAVE_LINUX_IF_ADDR_H=1 -DHAVE_LINUX_PERF_EVENT_H=1 -DHAVE_LINUX_QUOTA_H=1 -DHAVE_LINUX_RTNETLINK_H=1 -DHAVE_LOCALECONV=1 -DHAVE_LOCALTIME_R=1 -DHAVE_LSTAT64=1 -DHAVE_MALLINFO=1 -DHAVE_MALLOC_H=1 -DHAVE_MALLOC_USABLE_SIZE=1 -DHAVE_MEMALIGN=1 -DHAVE_MEMMEM=1 -DHAVE_MOVEMAIL=1 -DHAVE_NETINET_IN_H=1 -DHAVE_NL_TYPES_H=1 -DHAVE_POSIX_FADVISE=1 -DHAVE_POSIX_FALLOCATE=1 -DHAVE_POSIX_MEMALIGN=1 -DHAVE_PTHREAD_H=1 -DHAVE_RES_NINIT=1 -DHAVE_SETPRIORITY=1 -DHAVE_STAT64=1 -DHAVE_STDINT_H=1 -DHAVE_STRERROR=1 -DHAVE_STRNDUP=1 -DHAVE_SYSCALL=1 -DHAVE_SYS_QUEUE_H=1 -DHAVE_SYS_QUOTA_H=1 -DHAVE_SYS_TYPES_H=1 -DHAVE_THREAD_TLS_KEYWORD=1 -DHAVE_TRUNCATE64=1 -DHAVE_UNISTD_H=1 -DHAVE_VALLOC=1 -DHAVE_VA_COPY=1 -DHAVE_VISIBILITY_ATTRIBUTE=1 -DHAVE_VISIBILITY_HIDDEN_ATTRIBUTE=1 -DHAVE__UNWIND_BACKTRACE=1 -DHAVE___CXA_DEMANGLE=1 -DJS_DEFAULT_JITREPORT_GRANULARITY=3 -DMALLOC_H='<malloc.h>' -DMALLOC_USABLE_SIZE_CONST_PTR='' -DMOZILLA_OFFICIAL=1 -DMOZILLA_UAVERSION='"60.0"' -DMOZILLA_VERSION='"60.7.5"' -DMOZILLA_VERSION_U=60.7.5 -DMOZ_ACCESSIBILITY_ATK=1 -DMOZ_ALLOW_LEGACY_EXTENSIONS=1 -DMOZ_APP_UA_NAME='""' -DMOZ_APP_UA_VERSION='"2.53.5"' -DMOZ_AV1=1 -DMOZ_BUILD_APP=../suite -DMOZ_BUNDLED_FONTS=1 -DMOZ_CONTENT_SANDBOX=1 -DMOZ_DAV1D_ASM=1 -DMOZ_DISABLE_STARTUPCACHE=1 -DMOZ_DISTRIBUTION_ID='"org.mozilla"' -DMOZ_DLL_SUFFIX='".so"' -DMOZ_ENABLE_DBUS=1 -DMOZ_ENABLE_MASK_AS_SHORTHAND=1 -DMOZ_ENABLE_SKIA=1 -DMOZ_ENABLE_STARTUP_NOTIFICATION=1 -DMOZ_ENABLE_XREMOTE=1 -DMOZ_FEEDS=1 -DMOZ_FFMPEG=1 -DMOZ_FFVPX=1 -DMOZ_FFVPX_FLACONLY=1 -DMOZ_FMP4=1 -DMOZ_GECKO_PROFILER=1 -DMOZ_GLUE_IN_PROGRAM=1 -DMOZ_GMP_SANDBOX=1 -DMOZ_INSTRUMENT_EVENT_LOOP=1 -DMOZ_LOGGING=1 -DMOZ_MACBUNDLE_ID=org.mozilla.seamonkey -DMOZ_MEMORY=1 -DMOZ_MORK=1 -DMOZ_PEERCONNECTION=1 -DMOZ_PERMISSIONS=1 -DMOZ_PLACES=1 -DMOZ_PULSEAUDIO=1 -DMOZ_RAW=1 -DMOZ_RUST_SIMD=1 -DMOZ_SAMPLE_TYPE_FLOAT32=1 -DMOZ_SANDBOX=1 -DMOZ_SCTP=1 -DMOZ_SEPARATE_MANIFEST_FOR_THEME_OVERRIDES=1 -DMOZ_SRTP=1 -DMOZ_STATIC_JS=1 -DMOZ_SUITE=1 -DMOZ_SYSTEM_ICU=1 -DMOZ_TREE_CAIRO=1 -DMOZ_UPDATE_CHANNEL=default -DMOZ_USER_DIR='".mozilla"' -DMOZ_VORBIS=1 -DMOZ_VPX_NO_MEM_REPORTING=1 -DMOZ_WEBM_ENCODER=1 -DMOZ_WEBRTC=1 -DMOZ_WEBRTC_ASSERT_ALWAYS=1 -DMOZ_WEBRTC_SIGNALING=1 -DMOZ_WEBSPEECH=1 -DMOZ_WEBSPEECH_TEST_BACKEND=1 -DMOZ_WIDGET_GTK=3 -DMOZ_X11=1 -DMOZ_XUL=1 -DNO_NSPR_10_SUPPORT=1 -DNS_PRINTING=1 -DNS_PRINT_PREVIEW=1 -DRELEASE_OR_BETA=1 -DSTATIC_JS_API=1 -DSTDC_HEADERS=1 -DTARGET_XPCOM_ABI='"x86-gcc3"' -DUSE_SKIA=1 -DUSE_SKIA_GPU=1 -DU_USING_ICU_NAMESPACE=0 -DVA_COPY=va_copy -DVPX_X86_ASM=1 -DXP_LINUX=1 -DXP_UNIX=1 -D_REENTRANT=1 -DAB_CD=en-US \
        --format omni \
        --removals /build/seamonkey/src/seamonkey-2.53.5/suite/installer/removed-files.in \
         \
         \
         \
         \
        --optimizejars \
        --disable-compression \
        package-manifest ../../dist ../../dist/seamonkey \
        --non-resource defaults/messenger/mailViews.dat defaults/profile/panels.rdf defaults/profile/mimeTypes.rdf defaults/profile/chrome/userChrome-example.css defaults/profile/chrome/userContent-example.css 
terminate called after throwing an instance of 'std::runtime_error'
  what():  Section index out of bounds
Traceback (most recent call last):
  File "/build/seamonkey/src/seamonkey-2.53.5/mozilla/toolkit/mozapps/installer/packager.py", line 326, in <module>
    main()
  File "/build/seamonkey/src/seamonkey-2.53.5/mozilla/toolkit/mozapps/installer/packager.py", line 320, in main
    copier.copy(args.destination)
  File "/build/seamonkey/src/seamonkey-2.53.5/mozilla/python/mozbuild/mozpack/copier.py", line 428, in copy
    copy_results.append((destfile, f.copy(destfile, skip_if_older)))
  File "/build/seamonkey/src/seamonkey-2.53.5/mozilla/python/mozbuild/mozpack/files.py", line 296, in copy
    elfhack(dest)
  File "/build/seamonkey/src/seamonkey-2.53.5/mozilla/python/mozbuild/mozpack/executables.py", line 124, in elfhack
    errors.fatal('Error executing ' + ' '.join(cmd))
  File "/build/seamonkey/src/seamonkey-2.53.5/mozilla/python/mozbuild/mozpack/errors.py", line 103, in fatal
    self._handle(self.FATAL, msg)
  File "/build/seamonkey/src/seamonkey-2.53.5/mozilla/python/mozbuild/mozpack/errors.py", line 98, in _handle
    raise ErrorMessage(msg)
mozpack.errors.ErrorMessage: Error: Error executing /build/seamonkey/src/seamonkey-2.53.5/obj-i686-pc-linux-gnu/build/unix/elfhack/elfhack ../../dist/seamonkey/libxul.so
make[2]: *** [/build/seamonkey/src/seamonkey-2.53.5/mozilla/toolkit/mozapps/installer/packager.mk:22: stage-package] Error 1
make[2]: Leaving directory '/build/seamonkey/src/seamonkey-2.53.5/obj-i686-pc-linux-gnu/suite/installer'
make[1]: *** [/build/seamonkey/src/seamonkey-2.53.5/mozilla/../suite/build.mk:13: install] Error 2
make[1]: Leaving directory '/build/seamonkey/src/seamonkey-2.53.5/obj-i686-pc-linux-gnu'
make: *** [client.mk:404: install] Error 2
==> ERROR: A failure occurred in package().
    Aborting...
==> ERROR: Build failed, check /var/lib/archbuild/slave1/staging-pentium4/slave1/build
used straw: :mirrored_source:mirrored_source_by_hash:

 87 PackagesBug ReportMediumLow firefox doesn't rebuild Closed
100%
Task Description

Attached to Project: Archlinux32
Opened by Andreas Baumann - 21.09.2019
Last edited by Andreas Baumann - 21.09.2019
 FS#87  - firefox doesn’t rebuild

OOM when build gkrust:

patching out debug_level=2 in moz.configure/toolchain.configure

thanks BoidLinux for the hint.

  Comments (3)
  Related Tasks (0/0)

Admin
Andreas Baumann commented on 21.09.2019 17:05

A test is executed testing the generated Gecko rust library (a static library), whether
it contains references to networking functions, this fails on IA32:

https://hg.mozilla.org/mozilla-central/rev/47cd8671b12c

$(call py_action,check_binary,–target –networking $@)

Solution is just not to execute this check in config/makefiles/rust.mk
Admin
Andreas Baumann commented on 21.09.2019 17:08

187:52.88 toolkit/library/libxul.so
190:00.47 readelf: Error: Unable to seek to 0x801db328 for section headers
190:01.36 out of memory allocating 3761314508 bytes after a total of 1595923192 bytes
190:01.47 File “/build/firefox/src/firefox-69.0.1/python/mozbuild/mozbuild/action/check_binary.py”, line 361, in

=&gt; python/readelf combo reads whole generated libxul.so into memory in order to do
some ELF fidding.

190:01.48 make[4]: *** [/build/firefox/src/firefox-69.0.1/config/rules.mk:661: libxul.so] Error 1

shows us:

$(SHARED_LIBRARY): $(OBJS) $(RESFILE) $(RUST_STATIC_LIB) $(STATIC_LIBS) $(EXTRA_DEPS) $(GLOBAL_DEPS)

      $(REPORT_BUILD)

ifndef INCREMENTAL_LINKER

      $(RM) $@

endif

      $(MKSHLIB) $($@_$(OBJS_VAR_SUFFIX)) $(RESFILE) $(LDFLAGS) $(STATIC_LIBS) $(RUST_STATIC_LIB) $(SHARE
      $(call py_action,check_binary,--target $@)

Trying to comment that out too (the python check).
Admin
Andreas Baumann commented on 22.09.2019 07:46

Now libxul.so misses some libraries, like libmozsandbox.so, liblgpllibs.so, … The libraries exists, but most likely libxul.so cannot find them (rpath ELF fiddling?).

As a workaround I’ll set LD_LIBRARY_PATH=/usr/lib/firefox in the startup wrapper
scripts /usr/bin/firefox.

Google Cache

 215 PackagesBug ReportMediumLow firefox 93.0 (and seamonkey 2.53.9.1) doesn't build Closed
100%
Task Description
 2:52.15 error: `[u32; 2]` is forbidden as the type of a const generic parameter
 2:52.15   --> /build/firefox/src/firefox-93.0/third_party/rust/packed_simd/src/codegen/llvm.rs:20:44
 2:52.15    |
 2:52.15 20 | pub unsafe fn __shuffle_vector2<const IDX: [u32; 2], T, U>(x: T, y: T) -> U
 2:52.15    |                                            ^^^^^^^^
 2:52.15    |
 2:52.15    = note: the only supported types are integers, `bool` and `char`
 2:52.15    = help: more complex types are supported with `#![feature(adt_const_params)]`
 2:52.15 error: `[u32; 4]` is forbidden as the type of a const generic parameter
 2:52.15   --> /build/firefox/src/firefox-93.0/third_party/rust/packed_simd/src/codegen/llvm.rs:30:44
 2:52.15    |
 2:52.15 30 | pub unsafe fn __shuffle_vector4<const IDX: [u32; 4], T, U>(x: T, y: T) -> U
 2:52.15    |                                            ^^^^^^^^
 2:52.15    |
 2:52.15    = note: the only supported types are integers, `bool` and `char`
 2:52.15    = help: more complex types are supported with `#![feature(adt_const_params)]`
 2:52.15 error: `[u32; 8]` is forbidden as the type of a const generic parameter
 2:52.15   --> /build/firefox/src/firefox-93.0/third_party/rust/packed_simd/src/codegen/llvm.rs:40:44
 2:52.15    |
 2:52.15 40 | pub unsafe fn __shuffle_vector8<const IDX: [u32; 8], T, U>(x: T, y: T) -> U
 2:52.15    |                                            ^^^^^^^^
 2:52.15    |
 2:52.15    = note: the only supported types are integers, `bool` and `char`
 2:52.15    = help: more complex types are supported with `#![feature(adt_const_params)]`
 2:52.15 error: `[u32; 16]` is forbidden as the type of a const generic parameter
 2:52.15   --> /build/firefox/src/firefox-93.0/third_party/rust/packed_simd/src/codegen/llvm.rs:50:45
 2:52.15    |
 2:52.15 50 | pub unsafe fn __shuffle_vector16<const IDX: [u32; 16], T, U>(x: T, y: T) -> U
 2:52.15    |                                             ^^^^^^^^^
 2:52.15    |
 2:52.15    = note: the only supported types are integers, `bool` and `char`
 2:52.15    = help: more complex types are supported with `#![feature(adt_const_params)]`
 2:52.15 error: `[u32; 32]` is forbidden as the type of a const generic parameter
 2:52.15   --> /build/firefox/src/firefox-93.0/third_party/rust/packed_simd/src/codegen/llvm.rs:60:45
 2:52.15    |
 2:52.15 60 | pub unsafe fn __shuffle_vector32<const IDX: [u32; 32], T, U>(x: T, y: T) -> U
 2:52.15    |                                             ^^^^^^^^^
 2:52.15    |
 2:52.15    = note: the only supported types are integers, `bool` and `char`
 2:52.15    = help: more complex types are supported with `#![feature(adt_const_params)]`
 2:52.15 error: `[u32; 64]` is forbidden as the type of a const generic parameter
 2:52.15   --> /build/firefox/src/firefox-93.0/third_party/rust/packed_simd/src/codegen/llvm.rs:70:45
 2:52.15    |
 2:52.15 70 | pub unsafe fn __shuffle_vector64<const IDX: [u32; 64], T, U>(x: T, y: T) -> U
 2:52.15    |                                             ^^^^^^^^^
 2:52.15    |
 2:52.15    = note: the only supported types are integers, `bool` and `char`
 2:52.15    = help: more complex types are supported with `#![feature(adt_const_params)]`
 2:52.35    Compiling num_cpus v1.13.0
 2:53.13    Compiling fluent-langneg v0.13.0
 2:53.15    Compiling intl_pluralrules v7.0.1
 2:53.59    Compiling intl-memoizer v0.5.1
 2:55.32    Compiling gl_generator v0.14.0
 2:55.37    Compiling cose-c v0.1.5
 2:55.96    Compiling time v0.1.43
 2:56.01    Compiling iovec v0.1.4
 2:56.05    Compiling atty v0.2.14
 2:56.21 For more information about this error, try `rustc --explain E0557`.
 2:56.23    Compiling net2 v0.2.37
 2:56.24 The following warnings were emitted during compilation:
 2:56.25 warning: Cannot set `RUSTC_BOOTSTRAP=1` from build script of `packed_simd v0.3.4 (https://github.com/hsivonen/packed_simd?rev=6a16f954950401b92b4e220fbf2dfaf6f00e1fb2#6a16f954)`.
 2:56.25 note: Crates cannot set `RUSTC_BOOTSTRAP` themselves, as doing so would subvert the stability guarantees of Rust for your project.
 2:56.25 error: could not compile `packed_simd` due to 13 previous errors
 2:56.25 warning: build failed, waiting for other jobs to finish...
 3:17.66 error: build failed
 174 PackagesBug ReportMediumLow firefox 87.0 doesn't build Closed
100%
Task Description

Again, we get into out-of-memory situations with rust:

pentium4
41:24.75   cargo:warning=src/vector_type.h:502:11: warning: ‘void* memcpy(void*, const void*, size_t)’ writing to an object of type ‘struct glsl::vec4’ with no trivial copy-assignment; use copy-assignment or copy-initialization instead [-Wclass-memaccess]
41:24.75   cargo:warning=  502 |     memcpy(&v, p, sizeof(v));
41:24.75   cargo:warning=      |     ~~~~~~^~~~~~~~~~~~~~~~~~
41:24.75   cargo:warning=In file included from src/gl.cc:78:
41:24.75   cargo:warning=src/glsl.h:1772:8: note: ‘struct glsl::vec4’ declared here
41:24.75   cargo:warning= 1772 | struct vec4 {
41:24.75   cargo:warning=      |        ^~~~
41:24.75   cargo:warning=
41:24.75   cargo:warning=cc1plus: out of memory allocating 21906724 bytes after a total of 213745664 bytes

i686
 6:42.75    Compiling geckoservo v0.0.1 (/build/firefox/src/firefox-87.0/servo/ports/geckolib)
Process Process-1:
Traceback (most recent call last):
  File "/usr/lib/python3.9/multiprocessing/process.py", line 315, in _bootstrap
    self.run()
  File "/usr/lib/python3.9/multiprocessing/process.py", line 108, in run
    self._target(*self._args, **self._kwargs)
  File "/build/firefox/src/firefox-87.0/testing/mozbase/mozsystemmonitor/mozsystemmonitor/resourcemonitor.py", line 141, in _collect
    while not _poll(pipe, poll_interval=sleep_interval):
  File "/build/firefox/src/firefox-87.0/testing/mozbase/mozsystemmonitor/mozsystemmonitor/resourcemonitor.py", line 107, in _poll
    return pipe.poll(poll_interval)
  File "/usr/lib/python3.9/multiprocessing/connection.py", line 262, in poll
    return self._poll(timeout)
  File "/usr/lib/python3.9/multiprocessing/connection.py", line 429, in _poll
    r = wait([self], timeout)
  File "/usr/lib/python3.9/multiprocessing/connection.py", line 936, in wait
    ready = selector.select(timeout)
  File "/usr/lib/python3.9/selectors.py", line 416, in select
    fd_event_list = self._selector.poll(timeout)
KeyboardInterrupt
52:46.35 make[4]: *** [/build/firefox/src/firefox-87.0/config/makefiles/rust.mk:348: force-cargo-library-build] Interrupt
52:46.35 make[3]: *** [/build/firefox/src/firefox-87.0/config/recurse.mk:72: toolkit/library/rust/target] Interrupt
52:46.35 make[2]: *** [/build/firefox/src/firefox-87.0/config/recurse.mk:34: compile] Interrupt
52:46.35 make[1]: *** [/build/firefox/src/firefox-87.0/config/rules.mk:355: default] Interrupt

Rust is 1.51.0 on both pentium4 and i686.

 332 PackagesBug ReportVery LowLow firefox 112 compilation Closed
100%
Task Description

any ideas hpw to get past this error (i686)?

18:33.80 /build/iceweasel/src/firefox-112.0/dom/base/nsTextFragmentGeneric.h:38:16: error: ‘any’ is not a member of ‘xsimd’
18:49.36 /build/iceweasel/src/firefox-112.0/dom/base/nsTextFragmentGeneric.h:16:70: error: incomplete type ‘xsimd::batch<short int, xsimd::sse2>’ used in nested name specifier
18:49.36 /build/iceweasel/src/firefox-112.0/dom/base/nsTextFragmentGeneric.h:35:31: error: ‘xsimd::batch<short int, xsimd::sse2> vectmask’ has incomplete type
18:49.36 /build/iceweasel/src/firefox-112.0/dom/base/nsTextFragmentGeneric.h:37:64: error: incomplete type ‘xsimd::batch<short int, xsimd::sse2>’ used in nested name specifier
 49 PackagesBug ReportMediumLow ffmpeg update failures in release and testing Closed
100%
Task Description

Attached to Project: Archlinux32
Opened by Levi - 20.08.2018
Last edited by Erich Eckner - 29.10.2018
 FS#49  - ffmpeg update failures in release and testing

When I have done a pacman -Syu recently, it offers to update libx264 with x264:

:: Replace libx264 with testing/x264? [Y/n]
resolving dependencies… looking for conflicting packages… error: failed to prepare transaction (could not satisfy dependencies)
:: removing libx264 breaks dependency ‘libx264.so=152-32’ required by ffmpeg

As can be seen there, it fails because a dependency is not met.

This is reportedly also a problem on the release branches.

Using pacman’s query functionality I can see that x264 claims to provide libx264.so=155-32 rather than 152-32 i.e. x264 is too new for the current version of ffmpeg.

I consider this a high priority defect because ffmpeg is used by rather a lot of a/v playback and transcoding software.
Steps to reproduce

$ pacman -Syu

Workaround

Press n and enter when it offers to upgrade libx264. Ensure you’re not using multiple -ys on your pacman invocation.
Suggested fix

Provide an updated ffmpeg.
Closed by Erich Eckner
29.10.2018 11:50
Reason for closing: Fixed

  Comments (0)

Google Cache

Bing Cache

 152 PackagesBug ReportMediumLow evolution cannot be installed or upgraded Closed
100%
Task Description

:: installing evolution-data-server (3.38.3-1.1) breaks dependency ‘libedataserver-1.2.so=24-32’ required by evolution

 45 PackagesBug ReportMediumLow doublecmd: access violation - Arch Linux Closed
100%
Task Description

21.06.2018 - Both the gtk2 and the qt5 version fail with: [FORMS.PP] ExceptionOccurred Sender=EAccessViolation Exception=Access violation Stack trace: …

 155 PackagesBug ReportMediumLow Display Manager GDM doesn't work Closed
100%
Task Description

We get the nice message “Oh no! Something has gone wrong”

 303 PackagesBug ReportVery LowLow codeblocks issue.. Closed
100%
Task Description

its requested that please push the codeblocks testing to stable..

 232 PackagesBug ReportVery LowLow clementine fails on missing libprotobuf.so.27 Closed
100%
Task Description

After just having updated my trusty EeePC 1000H to be fully up to date again, I discovered that clementine is no longer working. It fails, stating that libprotobuf.so.27 cannot be found. Looking in /usr/lib, I can see libprotobuf.so.28, so I assume that the clementine package needs a rebuild.

 226 PackagesBug ReportVery LowLow claws-mail needs to be recompiled on i686 Closed
100%
Task Description

On i686, with testing and without testing claws mail is broken:
$ claws-mail
claws-mail: error while loading shared libraries: liblber-2.4.so.2: cannot open shared object file: No such file or directory

While I run Parabola i686, the repositories being used come from Archlinux 32:
$ pacman -sS claws-mail
extra/claws-mail 4.0.0-2.0 [installed]

  A GTK+ based e-mail client

$ pacman -Q -o /usr/lib/liblber*
/usr/lib/liblber.so is owned by libldap 2.6.0-2.4
/usr/lib/liblber.so.2 is owned by libldap 2.6.0-2.4
/usr/lib/liblber.so.2.0.200 is owned by libldap 2.6.0-2.4
$ pacman -sS libldap
core/libldap 2.6.0-2.4 [installed]

  Lightweight Directory Access Protocol (LDAP) client libraries

$ pacman -Q -l libldap | grep /usr/lib/liblber
libldap /usr/lib/liblber.so
libldap /usr/lib/liblber.so.2
libldap /usr/lib/liblber.so.2.0.200

So it’s most probably broken on Arch Linux 32 as well.

Denis.

 156 PackagesBug ReportMediumLow Cinnamon fails to start Closed
100%
Task Description

Funny, but actually not really helping:

Feb 17 20:42:17 arch32-stable-pentium4 cinnamon-session[3846]: CRITICAL: t+0.01217s: We failed, but the fail whale is dead. Sorry....
287PackagesFeature RequestVery LowLowchromium not able to buildAssigned
0%
Task Description

Wait unfortunately i found a patch through which chromium would compile on x86

please try to build chromium using those patches

https://github.com/void-linux/void-packages/blob/master/srcpkgs/chromium/patches/reenable-linux-i686-builds.patch https://github.com/void-linux/void-packages/blob/master/srcpkgs/chromium/patches/chromium-i686-vaapi-fpermissive.patch https://github.com/void-linux/void-packages/blob/master/srcpkgs/chromium/patches/chromium-105-bitmap-include.patch https://github.com/void-linux/void-packages/blob/master/srcpkgs/chromium/patches/chromium-105-browser-include.patch

 233 PackagesBug ReportVery LowLow Cannot install smplayer due to broken dependency Closed
100%
Task Description

I am currently unable to install smplayer in testing due to a broken dependency of mpv

[~]$ sudo pacman -S smplayer
resolving dependencies...
warning: cannot resolve "libplacebo.so=120-32", a dependency of "mpv"
warning: cannot resolve "mpv", a dependency of "smplayer"
:: The following package cannot be upgraded due to unresolvable dependencies:
      smplayer

:: Do you want to skip the above package for this upgrade? [y/N] y
looking for conflicting packages...
 there is nothing to do
 334 PackagesBug ReportVery LowLow Calibre is out of date and will not start Closed
100%
Task Description

The latest version of calibre is 6.16.

The version in the repositories is 6.11.0-1.0 and unfortunately will no longer start.

[keith@Arch32 ~]$ calibre
Failed to import PyQt module: PyQt6.QtNetwork with error: /usr/lib/python3.10/site-packages/PyQt6/QtNetwork.abi3.so: undefined symbol: _ZN16QNetworkDatagram7destroyEP23QNetworkDatagramPrivate, version Qt_6
Traceback (most recent call last):
  File "/usr/bin/calibre", line 21, in <module>
    sys.exit(calibre())
  File "/usr/lib/calibre/calibre/gui_launch.py", line 72, in calibre
    from calibre.gui2.main import main
  File "/usr/lib/calibre/calibre/gui2/__init__.py", line 13, in <module>
    from qt.core import (
ImportError: cannot import name 'QNetworkProxyFactory' from 'qt.core' (/usr/lib/calibre/qt/core.py)
[keith@Arch32 ~]$ pacman -Qi calibre
Name            : calibre
Version         : 6.11.0-1.0
Description     : Ebook management application
Architecture    : pentium4
URL             : https://calibre-ebook.com
Licenses        : GPL3
Groups          : None
Provides        : None
Depends On      : hunspell  hyphen  icu  jxrlib  libmtp  libstemmer  libusb  libwmf  mathjax  mtdev  optipng  podofo
                  python-apsw  python-beautifulsoup4  python-cchardet  python-css-parser  python-cssselect  python-dateutil
                  python-dnspython  python-feedparser  python-html2text  python-html5-parser  python-jeepney  python-lxml
                  python-markdown  python-mechanize  python-msgpack  python-netifaces  python-pdftotext  python-pillow
                  python-psutil  python-py7zr  python-pychm  python-pycryptodome  python-pygments  python-pyqt6
                  python-pyqt6-webengine  python-regex  python-unrardll  python-zeroconf  qt6-imageformats  qt6-svg
                  qt6-webengine  ttf-liberation  uchardet  udisks2
Optional Deps   : poppler: required for converting pdf to html [installed]
                  speech-dispatcher: TTS support in the viewer
Required By     : None
Optional For    : None
Conflicts With  : calibre-common  calibre-python3
Replaces        : calibre-common  calibre-python3
Installed Size  : 91.69 MiB
Packager        : Andreas Baumann <mail@andreasbaumann.cc>
Build Date      : Thu 12 Jan 2023 05:31:50 GMT
Install Date    : Tue 24 Jan 2023 10:15:48 GMT
Install Reason  : Explicitly installed
Install Script  : No
Validated By    : Signature

[keith@Arch32 ~]$ 
Showing tasks 101 - 150 of 350 Page 3 of 7 - 1 - 2 - 3 - 4 - 5 - Last >>

Available keyboard shortcuts

Tasklist

Task Details

Task Editing