Bugs in Archlinux32 packages, specific to 32-bit issues.

Bugs  FS#2  to  FS#92  have been recovered and may be incomplete, the
recovered Google/Bing cache data can be found here.

IDCategory  ascTask TypePrioritySeveritySummaryStatusProgress
141DevopsBug ReportMediumLowmake iso build more reliablyNew
Task Description

Currently, the iso build are several bash scripts on several machines requiring to move stuff via sshfs and alike.

This should become more stable - ideally some single script/package/systemd-unit with proper error reporting (email or irc come to my mind)

 168 DevopsBug ReportMediumLow i486 slaves are no longer working Closed
Task Description

+ exec setarch i486 systemd-nspawn -q -D /var/lib/archbuild/staging-i486/root -E PATH=/usr/local/sbin:/usr/local/bin:/usr/bin –register=no –keep-unit –as-pid2 –bind=/var/cache/archbuild32 pacman -Syuu –noconfirm
error: failed to initialize alpm library

176DevopsFeature RequestMediumLowbring back archiso32 dual bootNew
Task Description

We should make archiso32 be able to build a i686- and x86_64-bootable iso, again. This is really handy on a usb stick as a rescue system.

The problem with the old dual iso is, that I had to do the i686 iso from scratch, because upstream changed from build.sh to putting everything into mkarchiso. Now, everything is steered from a profile file.

So either, we find a way to make a profile for multiple architectures, or we need to patch mkarchiso to do that for us - and maybe upstream these changes.

 178 DevopsBug ReportVery LowLow New installer overwrites pacman mirrors Closed
Task Description

I tried to install archlinux32 using the archinstall installer, which is shipped with the installation medium.
Installation is working fine until pacstrap, where it will crash because all mirrors will return 404. I checked
my connection and it is working and dns also works. When I viewed the /etc/pacman.d/mirrorlist file, I saw that the script
wrote the default archlinux mirrors for the region specified in the installer to the file and the don’t contain the 32bit packages.

 187 DevopsBug ReportMediumLow linux-pae is for x86_64? Closed
Task Description

This seems to be a problem of either update-archlinux32-package in devops or of the (commented) code path in the PKGBUILD which gets executed by this script.

 302 DevopsFeature RequestVery LowLow Are you gonna continue 486 support? Closed
Task Description


486 will be removed from the kernel and especially from 6.1 onwards rust will be integrated with the kernel…

 191 PackagesBug ReportVery LowCritical mpv links against libsrt.so.1 which does not exist Closed
Task Description
$ pacman -Qs mpv
local/mpv 1:0.33.1-1.0
    a free, open source, and cross-platform media player
$ pacman -Qs srt
local/srt 1.4.3-1.0
    Secure Reliable Transport library
$ pacman -Fl srt | grep libsrt
srt usr/lib/libsrt.so
srt usr/lib/libsrt.so.1.4
srt usr/lib/libsrt.so.1.4.3
$ mpv
mpv: error while loading shared libraries: libsrt.so.1: cannot open shared object file: No such file or directory
$ ldd /usr/bin/mpv | grep srt
	libsrt.so.1 => not found
$ sudo ln -s /usr/lib/libsrt.so.1.4.3 /usr/lib/libsrt.so.1
$ mpv --version
mpv 0.33.1-dirty Copyright © 2000-2020 mpv/MPlayer/mplayer2 projects
 built on UNKNOWN
FFmpeg library versions:
   libavutil       56.51.100
   libavcodec      58.91.100
   libavformat     58.45.100
   libswscale      5.7.100
   libavfilter     7.85.100
   libswresample   3.7.100
FFmpeg version: n4.3.2

$ ldd /usr/bin/mpv | grep srt
	libsrt.so.1 => /usr/lib/libsrt.so.1 (0xb2a54000)

Running ldconfig does not create the missing symlink.

 198 PackagesBug ReportVery LowCritical [deleted due to spam] Closed
Task Description

no task description

 220 PackagesBug ReportVery HighCritical [python] completly broken Closed
Task Description

Traceback (most recent call last):

File "/usr/lib/python3.9/site-packages/mercurial/policy.py", line 69, in _importfrom
  fakelocals[modname] = mod = getattr(pkg, modname)
File "/usr/lib/python3.9/site-packages/mercurial/pycompat.py", line 307, in w
  return f(object, sysstr(name), *args)

AttributeError: module ‘mercurial.cext’ has no attribute ‘parsers’

During handling of the above exception, another exception occurred:

Traceback (most recent call last):

File "/usr/bin/hg", line 61, in <module>
File "/usr/lib/python3.10/importlib/util.py", line 247, in __getattribute__
File "<frozen importlib._bootstrap_external>", line 883, in exec_module
File "<frozen importlib._bootstrap>", line 241, in _call_with_frames_removed
File "/usr/lib/python3.9/site-packages/mercurial/dispatch.py", line 21, in <module>
  from .i18n import _
File "/usr/lib/python3.10/importlib/util.py", line 247, in __getattribute__
File "/usr/lib/python3.9/site-packages/mercurial/i18n.py", line 123, in <module>
  if _plain():
File "/usr/lib/python3.9/site-packages/mercurial/i18n.py", line 115, in _plain
  b'HGPLAIN' not in encoding.environ
File "/usr/lib/python3.10/importlib/util.py", line 247, in __getattribute__
File "/usr/lib/python3.9/site-packages/mercurial/encoding.py", line 41, in <module>
  charencode = policy.importmod('charencode')
File "/usr/lib/python3.9/site-packages/mercurial/policy.py", line 116, in importmod
  mod = _importfrom(pn, mn)
File "/usr/lib/python3.9/site-packages/mercurial/policy.py", line 71, in _importfrom
  raise ImportError('cannot import name %s' % modname)

ImportError: cannot import name parsers

for instance when building nss.

 224 PackagesBug ReportVery LowCritical gpg broken on pentium4 Closed
Task Description

I had to rebuild sqlite to have dirmng start and still –recv-keys is not working, returning “general error”.

 225 PackagesBug ReportHighCritical [zstd] 1.5.1, zstd compressed ramdisk fails to load pro ...Closed
Task Description

kernel issue with some network card and/or
systemd subservice not working add all

I cannot login remotely or locally.

System drops to maintainance shell..

Not a single systemd subdaemon is working..

This also effectively kills all i486 build machines..

 304 PackagesBug ReportMediumCritical [systemd] 251.2 breaking systems, cannot login Closed
Task Description
Assertion 'close_nointr(fd) != -EBADF' failed at src/basic/fd-util.c:76, function safe_close(). Aborting.

The temporary workaround is to comment out ‘pam_system.so’ in system-auth and system-login..

340PackagesBug ReportVery LowCritical[chromium] broken due to outdated libraries, plus also ...Unconfirmed
Task Description

The package needs to be recompiled for re2 v10 and several required dependencies were not installed, such as icu69 (?) and more.

341PackagesBug ReportVery LowCriticalpython3 is version 11, but all packages install only 3....Unconfirmed
Task Description

From a fresh install just now:

The /usr/lib/python3.10/site-packages folder is full of dozens of files, but there is little in the 3.11 folder. Some examples: gajim yt-dlp zippy samba.

This seems to affect most new packages that I install, so it is by no means limited to just the examples.

355PackagesBug ReportMediumCriticalKDE packages fail to install because of /libNew
Task Description

Some KDE packages try to replace the ‘lib’ symlink with a directory, causing the system
to fail to start.

If you are lucky, pacman warns you about it and says:

pacman -S breeze-icons
resolving dependencies...
looking for conflicting packages...

Packages (1) breeze-icons-6.0.0-1.0

Total Installed Size:  71.92 MiB
Net Upgrade Size:       0.61 MiB

:: Proceed with installation? [Y/n] 
(1/1) checking keys in keyring                                  [##################################] 100%
(1/1) checking package integrity                                [##################################] 100%
(1/1) loading package files                                     [##################################] 100%
(1/1) checking for file conflicts                               [##################################] 100%
error: failed to commit transaction (conflicting files)
breeze-icons: /lib exists in filesystem (owned by filesystem)
Errors occurred, no packages were upgraded

I had one hard-to-reproduce case where I basically nuked my VMs with that.

The recovery procedure in this case is:

# Boot from last ISO
# mount /dev/xxx to /mnt
cd /usr
mv lib/cmake/* usr/lib/cmake/.
mv lib/qml /usr/lib/.
rmdir lib/cmake
rmdir lib
ln -s usr/lib lib

Packages known to misbehave are ‘kqtquickcharts’, ‘breeze-icons’. Surely more to follow..

 104 PackagesBug ReportMediumHigh [glibc] 2.31-1.0 broken Closed
Task Description

Real machines (i686) break apart in mutliple ways: systemd-journald fails to start, also udev seems to have trouble. This leaves one with a rescue console. And at least in my rescue console, my keyboard did not work.
I also have a pentium4 vm which won’t boot currently (I might give some details, when I have a little more time).

 111 PackagesBug ReportVery LowHigh [libxcrypt]: conflicts with glibc Closed
Task Description
# pacman -Syu
error: failed to commit transaction (conflicting files)
libxcrypt: /usr/include/crypt.h exists in filesystem (owned by glibc)
libxcrypt: /usr/lib/libcrypt.so exists in filesystem (owned by glibc)
Errors occurred, no packages were upgraded.

this is a rather critical bug - it is required by gtk and qt, via libcups; so most desktop users are affected by it

 119 PackagesBug ReportVery LowHigh [gdb] needs rebuilt after python upgrade Closed
Task Description

Pacman recently upgraded python from 3.8 to 3.9, which breaks the gdb package:

% gdb
gdb: error while loading shared libraries: libpython3.8.so.1.0: cannot open shared object file: No such file or directory
 121 PackagesBug ReportVery LowHigh Multiple packages need rebuild after libicu upgrade Closed
Task Description

Over in  FS#119 , @abaumann mentioned that the libicu upgrade from 67 to 68 was part of what broke gdb. I missed the libicu upgrade when looking at gdb, but now that that one is resolved, I noticed a number of other packages that still link against the old and now nonexistant /usr/lib/libicu*.so.67 files. On my particular system, the following packages are installed, link to icu 67, and need rebuilt as well:

* harfbuzz-icu (2.7.0-1.0)
* mongo-c-driver (1.17.3-1.0)
* postfix (3.5.6-2.0)
* postgresql (12.4-1.0)
* postgresql-old-upgrade (12.5-1.0)
* samba (4.12.3-1.2)
* smbclient (4.12.3-1.2)
* syslog-ng (3.28.1-3.0)
* texlive-bin (2020.54586-4.0)
* xfsprogs (5.8.0-1.0)

… but I’m sure you have a way of determining all the affected packages?

As a workaround, in case others have the same problem, I manually extracted the old versioned .so files from the previous package to get things working again:

tar -C / -xf /var/cache/pacman/pkg/icu-67.1-1.0-i686.pkg.tar.zst –wildcards ‘usr/lib/lib*.so.*’ ```

- I’ll just have to remember to clean them up again later.

 192 PackagesBug ReportVery LowHigh [postgis] not satisfiable dependency: "libproj.so.22" Closed
Task Description

The postgis package version 3.1.1-1.0 on pentium4 does not work because only
libproj-1.5.so is installed, and not the required libproj-2.2.so.

On upstream there seems to have been some rebuild of newer versions of gdal 3.2.2 and proj 8.0.0:

 212 PackagesBug ReportVery LowHigh libblockdev issue with glibc Closed
Task Description

Trying to start udisks2 daemon (systemctl start udisks2.service) fails because of a library issue.

/usr/lib/udisks2/udisksd: symbol lookup error: /usr/lib/libbd_utils.so.2: undefined symbol: g_spawn_check_wait_status

Maybe libblockdev needs to be recompiled with the right glibc version.

Thus, it is not possible to auto-mount external USB drives.

294PackagesBug ReportVery LowHigh[qtile] importlib.metadata.PackageNotFoundError: No pac...Assigned
Task Description

When running qtile I get the following error message:

[qtile] importlib.metadata.PackageNotFoundError: No package metadata was found for qtile

Running qtile on Arch Linux works as expected.

$ qtile start
Traceback (most recent call last):
  File "/usr/bin/qtile", line 33, in <module>
    sys.exit(load_entry_point('qtile==0.18.1', 'console_scripts', 'qtile')())
  File "/usr/bin/qtile", line 22, in importlib_load_entry_point
    for entry_point in distribution(dist_name).entry_points
  File "/usr/lib/python3.10/importlib/metadata/__init__.py", line 957, in distribution
    return Distribution.from_name(distribution_name)
  File "/usr/lib/python3.10/importlib/metadata/__init__.py", line 548, in from_name
    raise PackageNotFoundError(name)
importlib.metadata.PackageNotFoundError: No package metadata was found for qtile
$ pacman -Qi qtile
Name            : qtile
Version         : 0.18.1-3.0
Description     : A full-featured, pure-Python tiling window manager
Architecture    : pentium4
URL             : http://www.qtile.org
Licenses        : MIT
Groups          : None
Provides        : None
Depends On      : gdk-pixbuf2  glibc  libnotify  librsvg  pango  python-cairocffi  python-cffi  python-xcffib  python-gobject  python-setuptools
Optional Deps   : alsa-utils: for volume widget
                  canto-daemon: for canto widget
                  cmus: for cmus widget
                  jupyter_console: for interaction with qtile via Jupyter
                  khal: for khal_calendar widget
                  libpulse: for pulse_volume and pulseaudio_ffi widget [installed]
                  lm_sensors: for sensors widget [installed]
                  moc: for moc widget
                  python-dbus-next: for utils, notifications and several widgets
                  python-iwlib: for wlan widget
                  python-keyring: for imapwidget widget
                  python-mpd2: mpd2widget widget
                  python-psutil: graph, net and memory widget [installed]
                  python-pywlroots: for experimental wayland support
                  python-setproctitle: change process name to qtile
                  python-xdg: launchbar widget
Required By     : None
Optional For    : None
Conflicts With  : None
Replaces        : None
Installed Size  : 3.25 MiB
Packager        : Andreas Baumann <mail@andreasbaumann.cc>
Build Date      : Mon 04 Oct 2021 12:02:58
Install Date    : Mon 26 Sep 2022 13:33:45
Install Reason  : Explicitly installed
Install Script  : Yes
Validated By    : Signature
$ sudo pacman -Syu
:: Synchronizing package databases...
 core downloading...
 extra downloading...
 community downloading...
:: Starting full system upgrade...
 there is nothing to do
325PackagesBug ReportVery LowHigh[terminus] crashes with message undefined symbol: cairo...Unconfirmed
Task Description

Starting terminus gives following error:

from ._cairo import *  # noqa: F401,F403
ImportError: /usr/lib/python3.10/site-packages/cairo/_cairo.cpython-310-i386-linux-gnu.so: undefined symbol: cairo_tee_surface_index

Bug seens to be related to


There is generall mess on cairo related files for different architectures (pentium4, i486, i686) - some packages for one architecture are outdated, while for other archictectures are up to date, for instance:

  • python-cairo i486/extra : 1.21.0-1.0
  • python-cairo i686/extra : 1.23.0-3.0
  • python-cairo pentium4/extra : 1.23.0-3.0
 327 PackagesBug ReportVery LowHigh [firefox-] crashes in VMware virtua ...Closed
Task Description

This is pentium4 related problem. Firefox crashes on startup with following messages:

ExceptionHandler::GenerateDump cloned child 814
ExceptionHandler::SendContinueSignalToChild sent continue signal to child
ExceptionHandler::WaitForContinueSignal waiting for continue signal...

Screenshot. Firefox folder after crash.

Temporary solution is to change in /etc/pacman/conf


, delete firefox for pentium4 from pacman cache and reinstall firefox

 329 PackagesBug ReportVery LowHigh [go] Cannot install yay from AUR Closed
Task Description

Installing yay from AUR

git clone https://aur.archlinux.org/yay.git
cd yay
makepkg -sri

gives following error

go: updates to go.sum needed, disabled by -mod=readonly

Reason - outdated version of go in i686 architecture

Temporary solution - use go for pentium4 (change temporarily architecture to pentium4 in /etc/pacman.conf)

333PackagesBug ReportVery LowHighSddm 0.19.0-9.0 crashes with Qt 5.15.9Assigned
Task Description

The current version of sddm (0.19.0-9.0) depends on the previous version of Qt (5.15.8). After updating Qt, sddm crashes with an incompatible Qt library error.

 350 PackagesBug ReportVery LowHigh openssh service will not start Closed
Task Description

After updating my system I found that sshd.service will no longer start.

As a temporary work round I downgraded openssl from 3.2.1-1.0 to 3.1.4-1.0

[keith@Arch32 ~]$ sudo pacman -Syu
:: Synchronising package databases...
 core-testing is up to date
 core is up to date
 extra-testing is up to date
 extra is up to date
:: Starting full system upgrade...
resolving dependencies...
looking for conflicting packages...

Package (1)           Old Version  New Version  Net Change

core-testing/openssl  3.1.4-1.0    3.2.1-1.0      1.03 MiB

Total Installed Size:  10.54 MiB
Net Upgrade Size:       1.03 MiB

:: Proceed with installation? [Y/n] 
(1/1) checking keys in keyring                                                                 [--------------------------------------------------------] 100%
(1/1) checking package integrity                                                               [--------------------------------------------------------] 100%
(1/1) loading package files                                                                    [--------------------------------------------------------] 100%
(1/1) checking for file conflicts                                                              [--------------------------------------------------------] 100%
(1/1) checking available disk space                                                            [--------------------------------------------------------] 100%
:: Processing package changes...
(1/1) upgrading openssl                                                                        [--------------------------------------------------------] 100%
:: Running post-transaction hooks...
(1/1) Arming ConditionNeedsUpdate...
[keith@Arch32 ~]$ systemctl restart sshd.service
[keith@Arch32 ~]$ systemctl status sshd.service
× sshd.service - OpenSSH Daemon
     Loaded: loaded (/usr/lib/systemd/system/sshd.service; enabled; preset: disabled)
     Active: failed (Result: exit-code) since Tue 2024-02-13 05:36:11 GMT; 6s ago
   Duration: 9ms
    Process: 1008 ExecStart=/usr/bin/sshd -D (code=exited, status=255/EXCEPTION)
   Main PID: 1008 (code=exited, status=255/EXCEPTION)
        CPU: 9ms

Feb 13 05:36:11 Arch32 systemd[1]: sshd.service: Scheduled restart job, restart counter is at 5.
Feb 13 05:36:11 Arch32 systemd[1]: Stopped OpenSSH Daemon.
Feb 13 05:36:11 Arch32 systemd[1]: sshd.service: Start request repeated too quickly.
Feb 13 05:36:11 Arch32 systemd[1]: sshd.service: Failed with result 'exit-code'.
Feb 13 05:36:11 Arch32 systemd[1]: Failed to start OpenSSH Daemon.
[keith@Arch32 ~]$ sudo downgrade openssl
loading packages...
warning: downgrading package openssl (3.2.1-1.0 => 3.1.4-1.0)
resolving dependencies...
looking for conflicting packages...

Package (1)  Old Version  New Version  Net Change

openssl      3.2.1-1.0    3.1.4-1.0     -1.03 MiB

Total Installed Size:   9.51 MiB
Net Upgrade Size:      -1.03 MiB

:: Proceed with installation? [Y/n] 
(1/1) checking keys in keyring                                                                 [--------------------------------------------------------] 100%
(1/1) checking package integrity                                                               [--------------------------------------------------------] 100%
(1/1) loading package files                                                                    [--------------------------------------------------------] 100%
(1/1) checking for file conflicts                                                              [--------------------------------------------------------] 100%
(1/1) checking available disk space                                                            [--------------------------------------------------------] 100%
:: Processing package changes...
(1/1) downgrading openssl                                                                      [--------------------------------------------------------] 100%
:: Running post-transaction hooks...
(1/1) Arming ConditionNeedsUpdate...
add openssl to IgnorePkg? [y/N] 
[keith@Arch32 ~]$ systemctl restart sshd.service
[keith@Arch32 ~]$ systemctl status sshd.service
● sshd.service - OpenSSH Daemon
     Loaded: loaded (/usr/lib/systemd/system/sshd.service; enabled; preset: disabled)
     Active: active (running) since Tue 2024-02-13 05:37:20 GMT; 5s ago
   Main PID: 1138 (sshd)
      Tasks: 1 (limit: 2293)
     Memory: 772.0K
        CPU: 61ms
     CGroup: /system.slice/sshd.service
             └─1138 "sshd: /usr/bin/sshd -D [listener] 0 of 10-100 startups"

Feb 13 05:37:20 Arch32 systemd[1]: Started OpenSSH Daemon.
Feb 13 05:37:20 Arch32 sshd[1138]: Server listening on port 22.
Feb 13 05:37:20 Arch32 sshd[1138]: Server listening on :: port 22.
[keith@Arch32 ~]$ 

 118 PackagesBug ReportVery LowMedium signing key is expired Closed
Task Description

When trying to install the package, packman complies about the the key to be of unknown trust. Cheking the keyring the associated key appers to be expired.

172PackagesBug ReportVery LowMediumiwd requires some kernel flagsUnconfirmed
Task Description

RC4 support not found
The following options are missing in the kernel:

 173 PackagesBug ReportVery LowMedium supertux is broken (depends on libboostfilesystem 0.72  ...Closed
Task Description

Supertux needs to be rebuilt as it currently depends on the wrong version of libboostfilesystem.

https://www.archlinux32.org/packages/i686/community/supertux/ not satisfiable dependency: “libboost_filesystem.so.1.72.0” (link)
not satisfiable dependency: “libboost_locale.so.1.72.0” (link)

This affects all architectures (i686 and pentium4)

210PackagesBug ReportVery LowMediumkeymap don't gets fixed on login as set in /etc/vconsol...Unconfirmed
Task Description

gzip comes with asm code, if enabled, built a TEXTREL which gets bloqued on boot, so systemd don’t set keymap
A lot of tricks in forums, old thread more complete here $506 An old problem. Work around while asm gets fixed is call configure with DEFS=”NO_ASM” like this:

export DEFS="NO_ASM"
./configure ....


./configure DEFS="NO_ASM" ....

I have not tested it, but gentoo on x32 have gzip like this and no TEXTRELS here.
No matter i486, i686 or pentium.

Hope it helps.

Best regards.

 211 PackagesBug ReportVery LowMedium asp32 Closed
Task Description

asp32 fails to export/checkout anything.


# asp32 export pacman
fatal: unable to update url base from redirection:

asked for: https://git.archlinux.org/svntogit/packages.git/info/refs?service=git-upload-pack
 redirect: https://gitlab.archlinux.org/explore/groups

error: failed to update remote packages64

243PackagesBug ReportVery LowMedium[linux and linux-zen] 5.16.12 needs a rebuild with gcc...New
Task Description

[linux and linux-zen] 5.16.12 needs a rebuild with gcc 11.2 so DKMS packages will work

get errors when dkms installing in make log

cc1: error: incompatible gcc/plugin versions
cc1: error: failed to initialize plugin ./scripts/gcc-plugins/structleak_plugin.so

 274 PackagesBug ReportVery LowMedium perl-term-readline-gnu should be rebuilt due to new per ...Closed
Task Description

When you have system update there is this warning:

Warn about old perl modules
WARNING: '/usr/lib/perl5/5.34' contains data from at least 1 packages which will NOT be used by the installed perl interpreter.
 -> Run the following command to get a list of affected packages: pacman -Qqo '/usr/lib/perl5/5.34'

After searching you see it’s caused by

$ pacman -Qqo '/usr/lib/perl5/5.34'

So this package should be rebulded, because in repositories is perl 5.36

More info and problem description https://forum.manjaro.pl/t/archlinux32-ostrzezenie-od-perl/2356

 317 PackagesBug ReportVery LowMedium [pacutils] paccheck core dumps Closed
Task Description

$ paccheck pacman
pacman: all dependencies satisfied
zsh: segmentation fault (core dumped) paccheck pacman

It seems to be in the –files check (as with that the crash happens quicker).

Debuginfod doesn’t seem to work for ArchLinux32 (unlike standard ArchLinux) so no debug symbols, but here is the gdb backtrace:

(gdb) bt
#0 0xb7d1989a in strnlen () from /usr/lib/libc.so.6
#1 0xb7d197ac in strncpy () from /usr/lib/libc.so.6
#2 0x00402abe in ?? ()
#3 0x0040244a in ?? ()
#4 0xb7c96129 in ?? () from /usr/lib/libc.so.6
#5 0xb7c961fd in __libc_start_main () from /usr/lib/libc.so.6
#6 0x004026f5 in ?? ()

Valgrind does not seem to work properly on Arch32 either, so I can’t test that.

 323 PackagesBug ReportVery LowMedium qemu-desktop installation error Closed
Task Description

While installing qemu-desktop for Archlinux32 following error appears:

/usr/bin/gtk-query-immodules-3.0: symbol lookup error: /usr/liblibpango-1.0.so.0: undefined symbol: hb_ot_color_has_paint

Pango version pango-1:1.50.14-1.0-pentium4. This is a problem of Archlinux32 only - in Archlinux there is no error.

 328 PackagesBug ReportVery LowMedium libreoffice-fresh on i686 is newer then pentium4 Closed
Task Description

i686:- libreoffice-fresh 7.3.4-2.1
pentium4:- libreoffice-fresh 7.3.2-1.0

335PackagesBug ReportVery LowMediumpython-setuptools-scm 7.1.0-4.1 missing dependencyUnconfirmed
Task Description

python-setuptools-scm 7.1.0-4.1 as found in the repo is missing the dependencies python-packaging and python-setuptools, which breaks the build of many other packages.

 344 PackagesBug ReportVery LowMedium [linux] No kernel updates Closed
Task Description

The linux kernel seems to be stuck at version 6.1.12.arch1-1.0. The build log of the latest stable kernel (linux-6.6.4.arch1-1.0) shows the following error:

=⇒ ERROR: Integrity checks (sha256) differ in size from the source array.

 357 PackagesBug ReportVery LowMedium pacman-contrib 1.10.5 requires rebuild Closed
Task Description

The pactree tool in pacman-contrib 1.10.5 requires libalpm.so.13 which belongs to an older version of pacman. Rebuilding pacman-contrib with the latest version of pacman installed should resolve the issue.

 5 PackagesBug ReportMediumLow [sbcl] fails to compile - Arch Linux Closed
Task Description

16.12.2017 - The best, I can get is trying to compile the git HEAD with clisp (instead of sbcl). However, this still errors with: entering make-target-2.sh

 6 PackagesBug ReportMediumLow [libreoffice-still] 5.3.7-4 crashes when opening a ... Closed
Task Description

07.11.2017 - Nov 07 18:19:32 arch32-testing systemd[1]: Started Process Core Dump (PID 643/UID 0). Nov 07 18:19:35 arch32-testing …

 7 PackagesBug ReportMediumLow unknown bug FS#7 Closed
Task Description

no task description

 10 PackagesBug ReportMediumLow unknown bug FS#10 Closed
Task Description

no task description

 11 PackagesBug ReportMediumLow unknown bug FS#11 Closed
Task Description

no task description

 13 PackagesBug ReportMediumLow [fox-devel] fails on 32-bit Intel - Arch Linux Closed
Task Description

16.11.2017 - It’s the development version of the FOX toolkit. Breaks in some int/FXival/void * abstractions: FXWSQueue.cpp: In member function ‘FX::FXbool …

 14 PackagesBug ReportMediumLow [ghc-mod] Needs rebuilt Closed
Task Description

Attached to Project: Archlinux32
Opened by Luke Shumaker - 21.11.2017
Last edited by Erich Eckner - 25.11.2017
 FS#14  - [ghc-mod] Needs rebuilt

Yesterday, I mentioned on IRC that many haskell packages need rebuilt. In response, deep42thought moved a bunch of packages from staging to stable, and told me to open a bug report if the issue persisted.

For the most part, this seems resolved. Some pacman -Qo/-Ql/ldd/grep magic tells me that all of the haskell packages I have are fine, except for [ghc-mod].
Closed by Erich Eckner
25.11.2017 14:58
Reason for closing: Fixed
Additional comments about closing:

removed - upstream removed it, too

  Comments (1)
  Related Tasks (0/0)

Luke Shumaker commented on 23.11.2017 04:47

deep42thought has removed ghc-mod, reflecting its removal in Arch. Requesting closure.

Google Cache

 16 PackagesBug ReportMediumLow [libreoffice-still] still using icu 59 - Arch Linux Closed
Task Description

 FS#16  : [libreoffice-still] still using icu 59 - Arch Linux
28.11.2017 - /usr/lib/libreoffice/program/soffice.bin: error while loading shared libraries: libicuuc.so.59: cannot open shared object file: No such file or …

 17 PackagesBug ReportMediumLow nvidia and nvidia-lts kernel module build failure on 32 ...Closed
Task Description

26.11.2017 - In file included from ./arch/x86/include/asm/page.h:75:0, from ./arch/x86/include/asm/thread_info.h:11, from ./include/linux/thread_info.h:37, …

 18 PackagesBug ReportMediumLow  [android-tools] missing a -latomic when linking adb .. Closed
Task Description

08.12.2017 -  FS#18  - [android-tools] missing a -latomic when linking adb (and maybe other utilities). Didn’t find the place where to report this upstream!?

Showing tasks 1 - 50 of 350 Page 1 of 71 - 2 - 3 - 4 - 5 - Last >>

Available keyboard shortcuts


Task Details

Task Editing