Bugs in Archlinux32 packages, specific to 32-bit issues.

Bugs  FS#2  to  FS#92  have been recovered and may be incomplete, the
recovered Google/Bing cache data can be found here.

IDCategoryTask TypePrioritySeverity  descSummaryStatusProgress
 358 PackagesBug ReportMediumLow All versions of samba > 4.17.5 are broken Closed
100%
Task Description

Either because of ICU or LDB incompatibilites.
tdb, ldb, samba and python have to be rebuild.

 356 PackagesBug ReportMediumLow mkinitcpio core dump Closed
100%
Task Description
double free or corruption (out)
/usr/bin/mkinitcpio: line 557:  2387 Aborted                 (core dumped) MKINITCPIO_PROCESS_PRESET="$preset_name" "$0" "${preset_cmd[@]}"
error: command failed to execute correctly

Maybe also the age of the machine, the CMOS, the RAM, the moon, the universe could be
at fault here..

 354 PackagesBug ReportVery LowLow staging mkinitcpio<->cryptsetup conflict Closed
100%
Task Description

it is not possible to enable staging

$ sudo pacman -Syuu
:: Synchronizing package databases...
 core-staging is up to date
 core is up to date
 extra-staging                      2.5 MiB  2.22 MiB/s 00:01 [##################################] 100%
 extra is up to date
 community-staging is up to date
 community is up to date
:: Starting full system upgrade...
resolving dependencies...
:: There are 2 providers available for dbus-units:
:: Repository core-staging
   1) dbus-broker-units  2) dbus-daemon-units

Enter a number (default=1): 
looking for conflicting packages...
:: cryptsetup and mkinitcpio are in conflict. Remove mkinitcpio? [y/N] y
error: failed to prepare transaction (could not satisfy dependencies)
:: unable to satisfy dependency 'initramfs' required by linux
 353 PackagesBug ReportVery LowLow mc: is broken Closed
100%
Task Description
$ mc
mc: symbol lookup error: mc: undefined symbol: g_string_new_take

$ mcedit
mcedit: symbol lookup error: mcedit: undefined symbol: g_string_new_take
352PackagesBug ReportVery LowLowgmtp in extra is brokenUnconfirmed
0%
Task Description

It is an i686-system.

steps to reproduce:

    1) # pacman -Syyuu base
    2) # pacman -S gmtp
    3) $ gmtp

expected result:

    Start screen of gmtp appears.

actual result:

    $ gmtp
    gmtp: error while loading shared libraries: libFLAC.so.8: cannot open shared object file: No such file or directory

gmtp in extra-staging works though

349PackagesBug ReportMediumLowtop print "get_mempolicy: Function not implemented" on ...New
0%
Task Description

no task description

348PackagesBug ReportMediumLowopenssl failing testsNew
0%
Task Description
30-test_aesgcm.t ........................ ok                                                                ������������������������������������������������������������������                                                                                             

ALG_PERR: engines/e_afalg.c(463): Failed to bind socket : No such file or directory                         �����������������������������������������������������������������������������������������������������������������������������                                                                                   
        # ERROR: (bool) 'EVP_CipherInit_ex(ctx, cipher, e, key, iv, 1) == true' failed @ test/afalgtest.c   ������������������������������������������������������������������������������������������������������������������������������������������������������������c                                                                             :85                                                                                                         �����           
        # false                                                                                             �����������������������                                                        
        # 00000000:error:40000067:lib(128)::socket bind failed:engines/e_afalg.c:464:                       ������������������������������������������������������������������������������������������������������������������������������:                                                                                  
        # OPENSSL_TEST_RAND_SEED=1707239178                                                                 �����������������������������������������������������������������                                                                                             
        not ok 1 - iteration 1                                                                              ������������������������������������������ㄠ                                                                                                
# ------------------------------------------------------------------------------                            ������������������������������������������������������������������������������������������������������������������������                                                                                    
ALG_PERR: engines/e_afalg.c(463): Failed to bind socket : No such file or directory                         �����������������������������������������������������������������������������������������������������������������������������                                                                                   
        # ERROR: (bool) 'EVP_CipherInit_ex(ctx, cipher, e, key, iv, 1) == true' failed @ test/afalgtest.c   ������������������������������������������������������������������������������������������������������������������������������������������������������������c                                                                             :85                                                                                                         �����           
        # false                                                                                             �����������������������                                                        
        # 00000000:error:40000067:lib(128)::socket bind failed:engines/e_afalg.c:464:                       ������������������������������������������������������������������������������������������������������������������������������:                                                                                  
        # OPENSSL_TEST_RAND_SEED=1707239178                                                                 �����������������������������������������������������������������                                                                                             
        not ok 2 - iteration 2                                                                              ������������������������������������������㈠                                                                                                
# ------------------------------------------------------------------------------                            ������������������������������������������������������������������������������������������������������������������������                                                                                    
ALG_PERR: engines/e_afalg.c(463): Failed to bind socket : No such file or directory                         �����������������������������������������������������������������������������������������������������������������������������                                                                                   
        # ERROR: (bool) 'EVP_CipherInit_ex(ctx, cipher, e, key, iv, 1) == true' failed @ test/afalgtest.c   ������������������������������������������������������������������������������������������������������������������������������������������������������������c                                                                             :85                                                                                                         �����           
        # false                                                                                             �����������������������                                                        
        # 00000000:error:40000067:lib(128)::socket bind failed:engines/e_afalg.c:464:                       ������������������������������������������������������������������������������������������������������������������������������:                                                                                  
        # OPENSSL_TEST_RAND_SEED=1707239178                                                                 �����������������������������������������������������������������                                                                                             
        not ok 3 - iteration 3                                                                              ������������������������������������������㌠                                                                                                
# ------------------------------------------------------------------------------                            ������������������������������������������������������������������������������������������������������������������������                                                                                    
    # OPENSSL_TEST_RAND_SEED=1707239178                                                                     �����������������������������������������������������������                                                                                              
    not ok 1 - test_afalg_aes_cbc                                                                           ������������������������������������������������c                                                                                               
# ------------------------------------------------------------------------------                            ������������������������������������������������������������������������������������������������������������������������                                                                                    
../../util/wrap.pl ../../test/afalgtest => 1                                                                ������������������������������������������������������������������                                                                                             
not ok 1 - running afalgtest                                                                                ������������������������������������������                                                                                                 

347PackagesBug ReportVery LowLowMeld will not start - error message -> Meld requires Gt...Unconfirmed
0%
Task Description

[keith@Arch32 ~]$ meld
Meld requires Gtk+ 3.20 or higher.
[keith@Arch32 ~]$ pacman -Qi meld
Name : meld
Version : 3.22.0-2.0
Description : Compare files, directories and working copies
Architecture : any
URL : https://meldmerge.org/ Licenses : GPL Groups : None
Provides : None
Depends On : python-gobject python-cairo gtksourceview4 gsettings-desktop-schemas dconf
Optional Deps : None
Required By : None
Optional For : None
Conflicts With : None
Replaces : None
Installed Size : 5.06 MiB
Packager : TasosSah arch32@tasossah.com Build Date : Sat 19 Aug 2023 23:25:57 BST
Install Date : Sat 26 Aug 2023 07:08:59 BST
Install Reason : Explicitly installed
Install Script : No
Validated By : Signature

[keith@Arch32 ~]$ pacman -Qi gtksourceview4
Name : gtksourceview4
Version : 4.8.4-1.0
Description : A text widget adding syntax highlighting and more to GNOME
Architecture : pentium4
URL : https://wiki.gnome.org/Projects/GtkSourceView Licenses : GPL Groups : None
Provides : libgtksourceview-4.so=0-32
Depends On : gtk3 libxml2
Optional Deps : None
Required By : meld xed
Optional For : None
Conflicts With : None
Replaces : None
Installed Size : 7.44 MiB
Packager : Andreas Baumann mail@andreasbaumann.cc Build Date : Mon 07 Nov 2022 11:50:56 GMT
Install Date : Mon 28 Nov 2022 11:49:04 GMT
Install Reason : Installed as a dependency for another package
Install Script : No
Validated By : Signature

[keith@Arch32 ~]$ pacman -Qi gtk3
Name : gtk3
Version : 1:3.24.37-1.0
Description : GObject-based multi-platform GUI toolkit
Architecture : pentium4
URL : https://www.gtk.org/ Licenses : LGPL Groups : None
Provides : gtk3-print-backends libgailutil-3.so=0-32 libgdk-3.so=0-32 libgtk-3.so=0-32
Depends On : adwaita-icon-theme atk cairo cantarell-fonts dconf desktop-file-utils fontconfig fribidi gdk-pixbuf2 glib2 harfbuzz iso-codes

                libcloudproviders  libcolord  libcups  libegl  libepoxy  libgl  librsvg  libxcomposite  libx11  libxcursor  libxdamage  libxext  libxfixes
                libxi  libxinerama  libxkbcommon  libxrandr  libxrender  pango  shared-mime-info  wayland  at-spi2-core  tracker3  gtk-update-icon-cache

Optional Deps : evince: Default print preview command
Required By : bleachbit engrampa firefox gcr gpicview gspell gtkmm3 gtksourceview4 libdbusmenu-gtk3 libgnomekbd libindicator-gtk3 libnma

                libpeas  lightdm-gtk-greeter  lxmusic  vte3  xdg-user-dirs-gtk

Optional For : avahi gvfs libcanberra libdecor libreoffice-still
Conflicts With : gtk3-print-backends
Replaces : gtk3-print-backends⇐3.22.26-1
Installed Size : 49.88 MiB
Packager : Andreas Baumann mail@andreasbaumann.cc Build Date : Sun 16 Apr 2023 11:18:09 BST
Install Date : Tue 25 Apr 2023 13:06:04 BST
Install Reason : Installed as a dependency for another package
Install Script : Yes
Validated By : Signature

[keith@Arch32 ~]$

346PackagesBug ReportVery LowLowpandoc: error while loading shared librariesUnconfirmed
0%
Task Description
# pacman -Syyuu base
# pacman -S pandoc
# pandoc
pandoc: error while loading shared libraries: libHSzip-archive-0.4.1-FOOm53qGfUr2AB1Oel9iH4-ghc8.10.2.so: cannot open shared object file: No such file or directory
345PackagesBug ReportVery LowLow[gcompris-qt] doesn't start due to Qt 5.15.10Unconfirmed
0%
Task Description

I fails to start with: “Cannot mix incompatible Qt library (5.15.9) with this library (5.15.10)”

343PackagesBug ReportVery LowLowPackage 'screen 4.9.1-1.0' is missing dependency libute...Unconfirmed
0%
Task Description

Package ‘screen 4.9.1-1.0’ is missing dependency libutempter. I assume this is because libutempter used to be a dependency of util-linux which is part of base, so was assumed to be installed.

With the regular Arch Linux distro libutempter is still a dependency of util-linux.

339PackagesBug ReportVery LowLow[libcanberra-pulse]: can not be installedUnconfirmed
0%
Task Description
# pacman -S libcanberra-pulse
resolving dependencies...
warning: cannot resolve "libcanberra=0.30+2+gc0620e4-3.2", a dependency of "libcanberra-pulse"
:: The following package cannot be upgraded due to unresolvable dependencies:
      libcanberra-pulse

:: Do you want to skip the above package for this upgrade? [y/N]
error: failed to prepare transaction (could not satisfy dependencies)
:: unable to satisfy dependency 'libcanberra=0.30+2+gc0620e4-3.2' required by libcanberra-pulse
338PackagesBug ReportVery LowLow[libreoffice-still]: error while loading shared librari...Unconfirmed
0%
Task Description

needs rebuild against latest ‘boost’

$ sudo pacman -Sy libreoffice-still

$ pacman -Qs libreoffice-still
local/libreoffice-still 7.3.7-2.0
    LibreOffice maintenance branch

$ lowriter
javaldx: Could not find a Java Runtime Environment!
Warning: failed to read path from javaldx
/usr/lib/libreoffice/program/soffice.bin: error while loading shared libraries: libboost_locale.so.1.80.0: cannot open shared object file: No such file or directory
337PackagesBug ReportMediumLowpackages are being downgraded in reposNew
0%
Task Description

warning: filesystem: local (2023.09.18-1.0) is newer than core (2023.01.31-1.0)

336PackagesBug ReportVery LowLow[pyqt-builder]: needs rebuildUnconfirmed
0%
Task Description

just wanted to get this one on the board - i am unable to build ‘python-pyqt5’ which many other packages depend on, such as ‘qutebrowser’

the current ‘python-pyqt5’ PKGBUILD, which builds fine for x86_64 and arm, has unspecified dependencies in the i686 repos - not sure why that is

ModuleNotFoundError: No module named ‘jaraco.functools’
ModuleNotFoundError: No module named ‘jaraco.context’

that is easily fixed by requiring them explicitly:
> makedepends_i686=(’python-jaraco.context’ ‘python-jaraco.functools’)

however, after that, it gives a more fatal error:

sip-build: Unable to import ‘project.py’: No module named ‘pyqtbuild’

that module is in the ‘pyqt-builder’ package, i beleive - ‘pyqt-builder’ is installed as a build dependency; but it was built for python 3.9 - so probably that is why the build could not find the module

 334 PackagesBug ReportVery LowLow Calibre is out of date and will not start Closed
100%
Task Description

The latest version of calibre is 6.16.

The version in the repositories is 6.11.0-1.0 and unfortunately will no longer start.

[keith@Arch32 ~]$ calibre
Failed to import PyQt module: PyQt6.QtNetwork with error: /usr/lib/python3.10/site-packages/PyQt6/QtNetwork.abi3.so: undefined symbol: _ZN16QNetworkDatagram7destroyEP23QNetworkDatagramPrivate, version Qt_6
Traceback (most recent call last):
  File "/usr/bin/calibre", line 21, in <module>
    sys.exit(calibre())
  File "/usr/lib/calibre/calibre/gui_launch.py", line 72, in calibre
    from calibre.gui2.main import main
  File "/usr/lib/calibre/calibre/gui2/__init__.py", line 13, in <module>
    from qt.core import (
ImportError: cannot import name 'QNetworkProxyFactory' from 'qt.core' (/usr/lib/calibre/qt/core.py)
[keith@Arch32 ~]$ pacman -Qi calibre
Name            : calibre
Version         : 6.11.0-1.0
Description     : Ebook management application
Architecture    : pentium4
URL             : https://calibre-ebook.com
Licenses        : GPL3
Groups          : None
Provides        : None
Depends On      : hunspell  hyphen  icu  jxrlib  libmtp  libstemmer  libusb  libwmf  mathjax  mtdev  optipng  podofo
                  python-apsw  python-beautifulsoup4  python-cchardet  python-css-parser  python-cssselect  python-dateutil
                  python-dnspython  python-feedparser  python-html2text  python-html5-parser  python-jeepney  python-lxml
                  python-markdown  python-mechanize  python-msgpack  python-netifaces  python-pdftotext  python-pillow
                  python-psutil  python-py7zr  python-pychm  python-pycryptodome  python-pygments  python-pyqt6
                  python-pyqt6-webengine  python-regex  python-unrardll  python-zeroconf  qt6-imageformats  qt6-svg
                  qt6-webengine  ttf-liberation  uchardet  udisks2
Optional Deps   : poppler: required for converting pdf to html [installed]
                  speech-dispatcher: TTS support in the viewer
Required By     : None
Optional For    : None
Conflicts With  : calibre-common  calibre-python3
Replaces        : calibre-common  calibre-python3
Installed Size  : 91.69 MiB
Packager        : Andreas Baumann <mail@andreasbaumann.cc>
Build Date      : Thu 12 Jan 2023 05:31:50 GMT
Install Date    : Tue 24 Jan 2023 10:15:48 GMT
Install Reason  : Explicitly installed
Install Script  : No
Validated By    : Signature

[keith@Arch32 ~]$ 
 332 PackagesBug ReportVery LowLow firefox 112 compilation Closed
100%
Task Description

any ideas hpw to get past this error (i686)?

18:33.80 /build/iceweasel/src/firefox-112.0/dom/base/nsTextFragmentGeneric.h:38:16: error: ‘any’ is not a member of ‘xsimd’
18:49.36 /build/iceweasel/src/firefox-112.0/dom/base/nsTextFragmentGeneric.h:16:70: error: incomplete type ‘xsimd::batch<short int, xsimd::sse2>’ used in nested name specifier
18:49.36 /build/iceweasel/src/firefox-112.0/dom/base/nsTextFragmentGeneric.h:35:31: error: ‘xsimd::batch<short int, xsimd::sse2> vectmask’ has incomplete type
18:49.36 /build/iceweasel/src/firefox-112.0/dom/base/nsTextFragmentGeneric.h:37:64: error: incomplete type ‘xsimd::batch<short int, xsimd::sse2>’ used in nested name specifier
 331 PackagesBug ReportMediumLow [rust] rebootstrap Closed
100%
Task Description

seems like the virtual memory exhaustion is fixed in the newest version.
We have to bootstrap again (mainly for librsvg and firefox).

 330 PackagesBug ReportVery LowLow [gcompris-qt] no game icons Closed
100%
Task Description

gcompris-qt 3.0-1.0 is missing a dependency on llvm14 (or maybe it needs a rebuild for llvm) and thus it doesn’t show any game in the menu.

326PackagesBug ReportMediumLow[php] needs a rebuildNew
0%
Task Description

httpd/conf/httpd.conf: Cannot load modules/libphp.so into server: libssl.so.1.1>

 324 PackagesBug ReportMediumLow [libxft] segfaults Closed
100%
Task Description
Mar 08 19:16:01 arch32 audit[409]: ANOM_ABEND auid=1000 uid=0 gid=0 ses=5 pid=409 comm="slim" exe="/usr/bi                                                                                                          n/slim" sig=11 res=1                                                                                                                                                                                                
Mar 08 19:16:01 arch32 kernel: slim[409]: segfault at 30 ip b7dbe9e9 sp bf84f680 error 4 in libX11.so.6.4.                                                                                                          0[b7d9c000+8c000] likely on CPU 0 (core 0, socket 0)                                                                                                                                                                
Mar 08 19:16:01 arch32 kernel: Code: 04 00 00 83 c4 10 eb 8e 8d b4 26 00 00 00 00 66 90 53 e8 1a dd fd ff                                                                                                           81 c3 92 7a 11 00 83 ec 08 8b 44 24 10 8b 88 38 05 00 00 <8b> 51 30 83 fa ff 74 52 c7 41 30 ff ff ff ff 8b                                                                                                           88 d0 04 00 00 85                                                                                                                                                                  
Mar 08 19:16:01 arch32 systemd[1]: Started Process Core Dump (PID 424/UID 0).                                                                                                                                       
Mar 08 19:16:01 arch32 audit[1]: SERVICE_START pid=1 uid=0 auid=4294967295 ses=4294967295 msg='unit=system                                                                                                          d-coredump@1-424-0 comm="systemd" exe="/usr/lib/systemd/systemd" hostname=? addr=? terminal=? res=success'                                                                                                          
Mar 08 19:16:01 arch32 systemd-coredump[425]: [🡕] Process 409 (slim) of user 0 dumped core.                                                                                                                         
                                                                                                                                                                                                                    
                                              Stack trace of thread 409:                                                                                                                                            
                                              #0  0x00000000b7dbe9e9 _XAllocID (libX11.so.6 + 0x349e9)                                                                                                              
                                              #1  0x00000000b7d9f710 XCreatePixmap (libX11.so.6 + 0x15710)                                                                                                          
                                              #2  0x00000000b74cbd41 XRenderFindDisplay (libXrender.so.1 +                                                                                                           0x2d41)                                                                                                                                                                                                            
                                              #3  0x00000000b74cccf1 XRenderFreeGlyphSet (libXrender.so.1                                                                                                           + 0x3cf1)                                                                                                                                                                                                           
                                              #4  0x00000000b766e55b n/a (libXft.so.2 + 0x655b)                                                                                                                     
                                              #5  0x00000000b7c9a4fa _ZN5PanelD2Ev (libslim.so.1.3.6 + 0x1                                                                                                          34fa)                                                                                                                                                                                                               
                                              #6  0x00000000004bc49f _ZN3App13RestartServerEv (slim + 0xd4                                                                                                          9f)                                                                                                                                                                                                                 
                                              #7  0x00000000004bd623 _ZN3App5LoginEv (slim + 0xe623)                                                                                                                
                                              #8  0x00000000004bc073 _ZN3App3RunEv (slim + 0xd073)                                                                                                                  
                                              #9  0x00000000004b4742 main (slim + 0x5742)                                                                                                                           
                                              #10 0x00000000b7850129 n/a (libc.so.6 + 0x1f129)                                                                                                                      
                                              #11 0x00000000b78501fd __libc_start_main (libc.so.6 + 0x1f1f                                                                                                          d)                                                                                                                                                                                                                  
                                              #12 0x00000000004b48b5 _start (slim + 0x58b5)                                                                                                                         
                                              ELF object binary architecture: Intel 80386                                                                                                                           
321PackagesBug ReportMediumLow[gnome] brokenAssigned
0%
Task Description

mutter had a checksum issue (trivial).

gnome-shell misses a current version of gjs:

Dependency gjs-1.0 found: NO found 1.70.2 but need: '>= 1.73.1'
Did not find CMake 'cmake'
Found CMake: NO
Run-time dependency gjs-1.0 found: NO 

gnome-shell/meson.build:80:0: ERROR: Dependency lookup for gjs-1.0 with method 'pkgconfig' failed: Invalid version, need 'gjs-1.0' ['>= 1.73.1'] found '1.70.2'.

A full log can be found at /build/gnome-shell/src/build/meson-logs/meson-log.txt
320PackagesBug ReportMediumLow[btop] On i486 fails on clock_gettime64New
0%
Task Description

shows a red ERROR: on startup, strace shows:

write(2, "\n", 1
)                       = 1
clock_gettime64(CLOCK_REALTIME, {tv_sec=1675495215, tv_nsec=436798535}) = 0
exit_group(1)                           = ?
+++ exited with 1 +++
[root@eurobuild6-7-i486 ~]# btop
ERROR: No UTF-8 locale detected!
319PackagesBug ReportMediumLow[js102] rebuild results in a broken JS interpreter outp...New
0%
Task Description
 2:33.16 1 warning generated.
 2:47.25     Finished release [optimized] target(s) in 2m 24s
 3:50.23 js/src/build/libjs_static.a
 3:50.23 js/src/build/libmozjs-102.so
 3:51.27 js/src/gdb/gdb-tests
 3:51.27 js/src/shell/js
 3:51.33 js/src/jsapi-tests/jsapi-tests
 3:52.83 ./spidermonkey_checks.stub
 3:54.52 TEST-PASS | check_spidermonkey_style.py | ok
 3:54.79 TEST-PASS | check_macroassembler_style.py | ok
 3:54.84 TEST-PASS | check_js_opcode.py | ok
 3:55.04 7 compiler warnings present.
 3:55.09 Overall system resources - Wall time: 233s; CPU: 0%; Read bytes: 0; Write bytes: 0; Read time: 0; Write time: 0
 3:55.13 warning: intl/icu/source/i18n/nfsubs.cpp:1313:17 [-Wunused-but-set-variable] variable 'pow' set but not used
 3:55.13 warning: intl/icu/source/i18n/ucol.cpp:108:12 [-Wdeprecated-declarations] 'ucol_safeClone_71' is deprecated
 3:55.13 warning: mfbt/tests/TestResult.cpp:101:20 [-Wdeprecated-declarations] 'is_literal_type_v<mozilla::Result<int *, Failed>>' is deprecated
 3:55.13 warning: mfbt/tests/TestResult.cpp:102:20 [-Wdeprecated-declarations] 'is_literal_type_v<mozilla::Result<mozilla::Ok, Failed>>' is deprecated
 3:55.13 warning: mfbt/tests/TestResult.cpp:103:20 [-Wdeprecated-declarations] 'is_literal_type_v<mozilla::Result<mozilla::Ok, Foo8>>' is deprecated
 3:55.13 warning: mfbt/tests/TestResult.cpp:104:20 [-Wdeprecated-declarations] 'is_literal_type_v<mozilla::Result<Foo8, Foo16>>' is deprecated
 3:55.13 warning: mfbt/tests/TestResult.cpp:105:21 [-Wdeprecated-declarations] 'is_literal_type_v<mozilla::Result<mozilla::Ok, mozilla::UniquePtr<int>>>' is deprecated
 3:55.13 Your build was successful!
 Config object not found by mach.
Configure complete!
Be sure to run |mach build| to pick up any changes
To view resource usage of the build, run |mach resource-usage|.
To take your build for a test drive, run: |mach run|
Profiling instrumented JS...
/startdir/PKGBUILD: line 154:  6398 Segmentation fault      (core dumped) "$js" run.js
 318 PackagesBug ReportVery LowLow [multiple]: Note: This key has expired! Closed
100%
Task Description
$ wget http://pool.mirror.archlinux32.org/i686/core/binutils-2.40-2.0-i686.pkg.tar.zst
$ wget http://pool.mirror.archlinux32.org/i686/core/binutils-2.40-2.0-i686.pkg.tar.zst.sig
$ sudo pacman-key --verify binutils-2.40-2.0-i686.pkg.tar.zst.sig
==> Checking binutils-2.40-2.0-i686.pkg.tar.zst.sig... (detached)
gpg: Signature made Mon Jan 23 01:17:18 2023 EST
gpg:                using RSA key 16194A82231E9EF823562181C8E8F5A0AF9BA7E7
gpg: Good signature from "Andreas Baumann (sign) <mail@andreasbaumann.cc>" [expired]
gpg: Note: This key has expired!
Primary key fingerprint: 1619 4A82 231E 9EF8 2356  2181 C8E8 F5A0 AF9B A7E7
==> ERROR: The signature identified by binutils-2.40-2.0-i686.pkg.tar.zst.sig could not be verified.

<KitsuWhooa> fuse also fails for me

 316 PackagesBug ReportMediumLow [rust] exhausts virtual memory Closed
100%
Task Description
/usr/bin/ld: error: lib/libLLVMSupport.a(FileOutputBuffer.cpp.o)(.text._ZN12_GLOBAL__N_112OnDiskBufferD0Ev
) is too large (0x105 bytes)
/usr/bin/ld: failed to set dynamic section sizes: memory exhausted
collect2: error: ld returned 1 exit status

maybe we have to resort to cross-compiling rust in the end..

 315 Packages: StableBug ReportVery LowLow [ncmpcpp] requires wrongly boost libraries  Closed
100%
Task Description

ncmpcpp-git compiles on AUR with no problem with all dependencies found on AL32 repositories.

314PackagesBug ReportVery LowLowMumble requires a outdated protobuf Unconfirmed
0%
Task Description

libprotobuf=28 is a mumble (package) dependency, but protobuf package has libprotobuf=32.

I needed to downgrade to protobuf-3.17.3-1.3-pentium4.pkg.tar.zst (from the archive) to install mumble.

313PackagesBug ReportMediumLow[hg] broken on i486New
0%
Task Description
Traceback (most recent call last):
  File "/usr/bin/hg", line 59, in <module>
    dispatch.run()
  File "/usr/lib/python3.10/site-packages/mercurial/dispatch.py", line 143, in run
    status = dispatch(req)
  File "/usr/lib/python3.10/site-packages/mercurial/dispatch.py", line 232, in dispatch
    status = _rundispatch(req)
  File "/usr/lib/python3.10/site-packages/mercurial/dispatch.py", line 276, in _rundispatch
    ret = _runcatch(req) or 0
  File "/usr/lib/python3.10/site-packages/mercurial/dispatch.py", line 451, in _runcatch
    return _callcatch(ui, _runcatchfunc)
  File "/usr/lib/python3.10/site-packages/mercurial/dispatch.py", line 461, in _callcatch
    return scmutil.callcatch(ui, func)
  File "/usr/lib/python3.10/site-packages/mercurial/scmutil.py", line 153, in callcatch
    return func()
  File "/usr/lib/python3.10/site-packages/mercurial/dispatch.py", line 441, in _runcatchfunc
    return _dispatch(req)

That’s why ‘nss’ is not rebuilding on i486.

 312 PackagesBug ReportVery LowLow In testing calibre will not start Closed
100%
Task Description
[keith@Arch32 ~]$ calibre
Failed to import PyQt module: PyQt6.QtQuick with error: No module named 'PyQt6.QtQuick'
Traceback (most recent call last):
  File "/usr/bin/calibre", line 21, in <module>
    sys.exit(calibre())
  File "/usr/lib/calibre/calibre/gui_launch.py", line 73, in calibre
    main(args)
  File "/usr/lib/calibre/calibre/gui2/main.py", line 546, in main
    app, opts, args = init_qt(args)
  File "/usr/lib/calibre/calibre/gui2/main.py", line 123, in init_qt
    app = Application(args, override_program_name=override, windows_app_uid=MAIN_APP_UID)
  File "/usr/lib/calibre/calibre/gui2/__init__.py", line 1096, in __init__
    setup_to_run_webengine()
  File "/usr/lib/calibre/calibre/gui2/__init__.py", line 1078, in setup_to_run_webengine
    from qt.core import QQuickWindow, QSGRendererInterface
ImportError: cannot import name 'QQuickWindow' from 'qt.core' (/usr/lib/calibre/qt/core.py)
[keith@Arch32 ~]$ calibre --version
calibre (calibre 6.7.1)
[keith@Arch32 ~]$ 
311PackagesBug ReportMediumLow[ffmpeg] fails with SIGILL on i686Assigned
0%
Task Description

work fine on pentium4

reproducable: ffplay <file.mp4>

offending opcode:

 0xb5f315e7:  f3 0f 10 83 d0 0b 00 00 movss  
                  0xbd0(%ebx),%xmm0
310PackagesBug ReportMediumLow[webkit2gtk] needs a running RubyNew
0%
Task Description
<internal:/usr/lib/ruby/3.0.0/rubygems/core_ext/kernel_require.rb>:85:in `require': cannot load such file -- date_core (LoadError)
        from <internal:/usr/lib/ruby/3.0.0/rubygems/core_ext/kernel_require.rb>:85:in `require'
        from /usr/lib/ruby/3.0.0/date.rb:4:in `<top (required)>'
        from <internal:/usr/lib/ruby/3.0.0/rubygems/core_ext/kernel_require.rb>:85:in `require'
        from <internal:/usr/lib/ruby/3.0.0/rubygems/core_ext/kernel_require.rb>:85:in `require'
        from /build/webkit2gtk/src/webkitgtk-2.38.2/Source/JavaScriptCore/generator/GeneratedFile.rb:24:in `<top (required)>'
        from /build/webkit2gtk/src/webkitgtk-2.38.2/Source/JavaScriptCore/generator/DSL.rb:25:in `require_relative'
        from /build/webkit2gtk/src/webkitgtk-2.38.2/Source/JavaScriptCore/generator/DSL.rb:25:in `<top (required)>'
        from /build/webkit2gtk/src/webkitgtk-2.38.2/Source/JavaScriptCore/generator/main.rb:24:in `require_relative'
        from /build/webkit2gtk/src/webkitgtk-2.38.2/Source/JavaScriptCore/generator/main.rb:24:in `<main>'

And ruby is currently broken..

 309 PackagesBug ReportVery LowLow gcompris links to openssl-1.1.so Closed
100%
Task Description

```
gcompris-qt: error while loading shared libraries: libssl.so.1.1: cannot open shared object file: No such file or directory
```

 308 PackagesBug ReportVery LowLow gettext needs a rebuild for libunistring Closed
100%
Task Description

I’m on pentium4 and I’m getting:

/usr/bin/xgettext: error while loading shared libraries: libunistring.so.2: cannot open shared object file: No such file or directory
/usr/bin/msgmerge: error while loading shared libraries: libunistring.so.2: cannot open shared object file: No such file or directory
/usr/bin/msgfmt: error while loading shared libraries: libunistring.so.2: cannot open shared object file: No such file or directory

gettext 0.21.1-1.1
libunistring 1.1-2.0

 307 PackagesBug ReportMediumLow [i486] make guile JIT failing Closed
100%
Task Description
*** work/functions/guile.base   Wed Nov 16 17:55:19 2022
--- work/functions/guile.log    Wed Nov 16 17:55:19 2022
***************
*** 1,3 ****
--- 1,7 ----
+ JIT failed to initialize
+ disabling automatic JIT compilation
+ JIT failed due to resource exhaustion
+ disabling automatic JIT compilation
 306 PackagesBug ReportMediumLow [Xorg] fails on i686 Closed
100%
Task Description

For instance xauth cannot find libXext.so.6.

 303 PackagesBug ReportVery LowLow codeblocks issue.. Closed
100%
Task Description

its requested that please push the codeblocks testing to stable..

 302 DevopsFeature RequestVery LowLow Are you gonna continue 486 support? Closed
100%
Task Description

https://www.tomshardware.com/news/linux-removes-486-cpu-support

486 will be removed from the kernel and especially from 6.1 onwards rust will be integrated with the kernel…

 301 PackagesBug ReportVery LowLow [dino]: wont start Closed
100%
Task Description
# pacman -Syu dino
$ dino
main.vala:25: Fatal error: /usr/lib/libgupnp-1.2.so.1: undefined symbol: gssdp_client_can_reach
 300 PackagesBug ReportVery LowLow Pinta needs to be updated Closed
100%
Task Description

please update pinta i am facing problems with p.net clone and the closest is pinta so if u look to update it then it would be greatful

 299 PackagesFeature RequestVery LowLow [dart] request for bootstrapping dart Closed
100%
Task Description

The dart sdk files are still availble for ia32:-
https://storage.googleapis.com/dart-archive/channels/stable/release/2.18.2/sdk/dartsdk-linux-ia32-release.zip

can you send the old PKGBUILD which was used

 298 PackagesBug ReportVery LowLow Please update Arduino Closed
100%
Task Description

Arduino is out dated and my teacher said to use the latest arduino version 1.8.x for the robotics class…

 297 PackagesBug ReportVery LowLow jack2 can not install Closed
100%
Task Description
# pacman -S jack --noconfirm
:: There are 2 providers available for jack:
:: Repository extra
   1) jack2  2) pipewire-jack

Enter a number (default=1): 
resolving dependencies...
warning: cannot resolve "libcelt0.so=2-32", a dependency of "jack2"
:: The following package cannot be upgraded due to unresolvable dependencies:
      jack2

:: Do you want to skip the above package for this upgrade? [y/N] error: failed to prepare transaction (could not satisfy dependencies)

:: unable to satisfy dependency 'libcelt0.so=2-32' required by jack2
 296 PackagesBug ReportVery LowLow Fix terminal emulators  Closed
100%
Task Description

On arch32 currently foot and alacritty is broken

 295 PackagesBug ReportVery LowLow [qemu][seabios]: file conflict Closed
100%
Task Description
# pacman -S qemu seabios
resolving dependencies...
looking for conflicting packages...

Packages (2) qemu-6.2.0-4.0  seabios-1.16.0-3.2

Total Installed Size:  36.97 MiB

checking keyring...
checking package integrity...
loading package files...
checking for file conflicts...
/usr/share/qemu/bios-microvm.bin exists in both 'seabios' and 'qemu'
/usr/share/qemu/vgabios-ati.bin exists in both 'seabios' and 'qemu'
Errors occurred, no packages were upgraded.

 293 PackagesBug ReportVery LowLow Please update those packages:- Closed
100%
Task Description

Gimp
Krita

If possible can u add Julia Lang though its on blacklist but i will try to compile it :)

 292 PackagesFeature RequestVery LowLow Hey , if possible can u build temite based on https://g ...Closed
100%
Task Description

Note:- It will compile very easily as i have a modified PKGBUILD

# Maintainer: Frederik Schwan freswa@archlinux.org pkgdesc=’A simple VTE-based terminal’ pkgname=termite
pkgver=16.4
pkgrel=2
url=https://github.com/aperezdc/termite license=(LGPL)
depends=(gtk3 pcre2 gnutls vte-common)
makedepends=(gperf ‘meson>=0.58’ ninja)
arch=(’x86_64’,’i686’,’pentium4’‘i486’)
backup=(etc/xdg/termite/config)

source=(”${url}/releases/download/v${pkgver}/termite-${pkgver}.tar.xz”{,.asc})
b2sums=(’SKIP’

      'SKIP')

build () {

rm -rf _build
arch-meson _build "${pkgname}-${pkgver}"
meson compile -C _build

}

package () {

meson install -C _build --skip-subprojects vte --destdir "${pkgdir}"

}

 291 PackagesFeature RequestVery LowLow Hey , if possible can u build temite based on https://g ...Closed
100%
Task Description

Note:- It will compile very easily as i have a modified PKGBUILD

```
# Maintainer: Frederik Schwan freswa@archlinux.org pkgdesc=’A simple VTE-based terminal’ pkgname=termite
pkgver=16.4
pkgrel=2
url=https://github.com/aperezdc/termite license=(LGPL)
depends=(gtk3 pcre2 gnutls vte-common)
makedepends=(gperf ‘meson>=0.58’ ninja)
arch=(’x86_64’,’i686’,’pentium4’‘i486’)
backup=(etc/xdg/termite/config)

source=(”${url}/releases/download/v${pkgver}/termite-${pkgver}.tar.xz”{,.asc})
b2sums=(’SKIP’

      'SKIP')

build () {

rm -rf _build
arch-meson _build "${pkgname}-${pkgver}"
meson compile -C _build

}

package () {

meson install -C _build --skip-subprojects vte --destdir "${pkgdir}"

}
```

290PackagesBug ReportMediumLow[qt6-webengine] fails building with nodeNew
0%
Task Description
Traceback (most recent call last):
  File "/build/qt6-webengine/src/build/src/core/RelWithDebInfo/i686/../../../../../qtwebengine-everywhere-src-6.3.2/src/3rdparty/chromium/third_party/node/node.py", line 62, in <module>
    RunNode(sys.argv[1:])
  File "/build/qt6-webengine/src/build/src/core/RelWithDebInfo/i686/../../../../../qtwebengine-everywhere-src-6.3.2/src/3rdparty/chromium/third_party/node/node.py", line 57, in RunNode
    raise RuntimeError('Command \'%s\' failed\n%s' % (' '.join(cmd), err))
RuntimeError: Command '/usr/bin/node ../../../../../qtwebengine-everywhere-src-6.3.2/src/3rdparty/chromium/third_party/devtools-frontend/src/scripts/build/compress_files.js --file_list __third_party_devtools-frontend_src_compress__build_qt6-webengine_src_build_src_core_target_toolchain_target__rule..rsp' failed

This is presumably knitting together some documentation, node is currently broken on Arch32..

287PackagesFeature RequestVery LowLowchromium not able to buildAssigned
0%
Task Description

Wait unfortunately i found a patch through which chromium would compile on x86

please try to build chromium using those patches

https://github.com/void-linux/void-packages/blob/master/srcpkgs/chromium/patches/reenable-linux-i686-builds.patch https://github.com/void-linux/void-packages/blob/master/srcpkgs/chromium/patches/chromium-i686-vaapi-fpermissive.patch https://github.com/void-linux/void-packages/blob/master/srcpkgs/chromium/patches/chromium-105-bitmap-include.patch https://github.com/void-linux/void-packages/blob/master/srcpkgs/chromium/patches/chromium-105-browser-include.patch

Showing tasks 51 - 100 of 350 Page 2 of 7 - 1 - 2 - 3 - 4 - 5 - Last >>

Available keyboard shortcuts

Tasklist

Task Details

Task Editing