Bugs in Archlinux32 packages, specific to 32-bit issues.

Bugs  FS#2  to  FS#92  have been recovered and may be incomplete, the
recovered Google/Bing cache data can be found here.

IDCategoryTask TypePrioritySeveritySummaryStatusProgress  desc
 175 PackagesBug ReportVery LowLow [pango]: symbol lookup error: /usr/lib/libpango-1.0.so. ...Closed
100%
Task Description

this is a rather severe bug - it prevents GTK DMs, DEs, and programs from starting (lightdm, lxdm, lxde, leafpad)

the error is evident immediately in the pacman log - see: http://termbin.com/vezp

g_module_open() failed for /usr/lib/gdk-pixbuf-2.0/2.10.0/loaders/libpixbufloader-svg.so: /usr/lib/libpango-1.0.so.0: undefined symbol: g_memdup2
/usr/bin/gtk-query-immodules-3.0: symbol lookup error: /usr/lib/libpango-1.0.so.0: undefined symbol: g_memdup2

if you disable the DM service, you can get the same error by launching the DE directly

$ startlxde
/usr/bin/lxsession: symbol lookup error: /usr/lib/libpango-1.0.so.0: undefined symbol: g_memdup2
 177 Packages: TestingBug ReportMediumMedium [gcc] CPU ISA level is lower than required Closed
100%
Task Description

$ cc –version
cc: CPU ISA level is lower than required

The same happens in a chroot for [staging].

$ pacman -Qo /usr/bin/cc
/usr/bin/cc is owned by gcc 10.2.0-6.0

$ pacman -Q glibc
glibc 2.33-4.0

Does that mean, anything building with gcc is doomed on i686, currently?

 178 DevopsBug ReportVery LowLow New installer overwrites pacman mirrors Closed
100%
Task Description

I tried to install archlinux32 using the archinstall installer, which is shipped with the installation medium.
Installation is working fine until pacstrap, where it will crash because all mirrors will return 404. I checked
my connection and it is working and dns also works. When I viewed the /etc/pacman.d/mirrorlist file, I saw that the script
wrote the default archlinux mirrors for the region specified in the installer to the file and the don’t contain the 32bit packages.

 179 Packages: StableBug ReportVery LowMedium Snapper needs rebuild from icu upgrade Closed
100%
Task Description

icu69.1-1.0 however snapper still links against libicuuc.so.68

Running snapper now gives the following error:

# snapper list /
snapper: error while loading shared libraries: libicuuc.so.68: cannot open shared object file: No such file or directory
 180 Packages: StableBug ReportVery LowLow Pandoc requires specific-version haskell dependencies Closed
100%
Task Description
# pandoc --version
pandoc: error while loading shared libraries: libHSzip-archive-0.4.1-4yLWnBS0zifKkvfHVbmUo1-ghc8.10.2.so: cannot open shared object file: No such file or directory
<code>

Versions:
<code>
# pacman -Q | grep haskell
haskell-aeson 1.5.4.1-19.0
haskell-aeson-pretty 0.8.8-94.0
haskell-ansi-terminal 0.11-17.0
haskell-asn1-encoding 0.9.6-58.0
haskell-asn1-parse 0.9.5-58.0
haskell-asn1-types 0.3.4-37.0
haskell-assoc 1.0.2-27.0
haskell-async 2.2.2-40.0
haskell-attoparsec 0.13.2.4-36.0
haskell-base-compat 0.11.2-4.2
haskell-base-compat-batteries 0.11.2-11.0
haskell-base-orphans 0.8.3-14.0
haskell-base16-bytestring 0.1.1.7-3.0
haskell-base64-bytestring 1.2.0.1-3.0
haskell-basement 0.0.11-10.1
haskell-bifunctors 5.5.8-13.0
haskell-blaze-builder 0.4.2.1-2.1
haskell-blaze-html 0.9.1.2-57.0
haskell-blaze-markup 0.8.2.7-41.0
haskell-byteable 0.1.1-22.1
haskell-case-insensitive 1.2.1.0-39.0
haskell-cereal 0.5.8.1-9.0
haskell-citeproc 0.3.0.9-9.0
haskell-cmdargs 0.10.21-1.0
haskell-colour 2.3.5-75.0
haskell-commonmark 0.1.1.2-2.0
haskell-commonmark-extensions 0.2.0.3-1.0
haskell-commonmark-pandoc 0.2.0.1-24.0
haskell-comonad 5.0.6-58.0
haskell-conduit 1.3.4-3.0
haskell-conduit-extra 1.3.5-70.0
haskell-connection 0.3.1-99.0
haskell-cookie 0.4.5-9.1
haskell-cryptonite 0.27-32.0
haskell-data-default 0.7.1.1-87.0
haskell-data-default-class 0.1.2.0-21.1
haskell-data-default-instances-containers 0.0.1-33.1
haskell-data-default-instances-dlist 0.0.1-100.0
haskell-data-default-instances-old-locale 0.0.1-33.1
haskell-data-fix 0.3.0-35.0
haskell-digest 0.0.1.2-22.1
haskell-distributive 0.6.2-40.0
haskell-dlist 1.0-23.0
haskell-doclayout 0.3-45.0
haskell-doctemplates 0.9-40.0
haskell-emojis 0.1-47.0
haskell-erf 2.0.0.0-21.0
haskell-errors 2.3.0-59.1
haskell-file-embed 0.0.13.0-3.1
haskell-glob 0.10.1-28.0
haskell-haddock-library 1.9.0-58.0
haskell-hashable 1.3.0.0-36.0
haskell-hourglass 0.2.12-82.0
haskell-hslua 1.3.0-2.0
haskell-hslua-module-system 0.2.2.1-17.0
haskell-hslua-module-text 0.3.0.1-5.0
haskell-hsyaml 0.2.1.0-52.0
haskell-http 4000.3.15-49.0
haskell-http-client 0.7.6-14.0
haskell-http-client-tls 0.3.5.3-359.0
haskell-http-types 0.12.3-100.0
haskell-hxt 9.3.1.18-196.0
haskell-hxt-charproperties 9.5.0.0-1.0
haskell-hxt-regex-xmlschema 9.2.0.7-2.0
haskell-hxt-unicode 9.0.2.4-22.0
haskell-indexed-traversable 0.1.1-3.1
haskell-integer-logarithms 1.0.3.1-3.1
haskell-ipynb 0.1.0.1-192.0
haskell-jira-wiki-markup 1.3.2-27.0
haskell-juicypixels 3.3.5-37.0
haskell-memory 0.15.0-49.0
haskell-mime-types 0.1.0.9-11.1
haskell-mono-traversable 1.0.15.1-74.0
haskell-network 3.1.2.1-1.0
haskell-network-uri 2.6.3.0-217.0
haskell-old-locale 1.0.0.7-27.1
haskell-old-time 1.1.0.3-27.1
haskell-pandoc-types 1.22-13.0
haskell-pem 0.2.4-114.0
haskell-primitive 0.7.1.0-29.0
haskell-quickcheck 2.14.2-11.0
haskell-random 1.2.0-54.0
haskell-resourcet 1.2.4.2-31.0
haskell-safe 0.3.19-5.1
haskell-scientific 0.3.6.2-53.0
haskell-sha 1.6.4.4-16.1
haskell-skylighting 0.10.2-24.0
haskell-skylighting-core 0.10.2-24.0
haskell-socks 0.6.1-90.0
haskell-split 0.2.3.4-88.0
haskell-splitmix 0.1.0.3-5.0
haskell-streaming-commons 0.2.2.1-28.1
haskell-strict 0.4.0.1-1.0
haskell-syb 0.7.1-8.0
haskell-tagged 0.8.6.1-2.2
haskell-tagsoup 0.14.8-75.0
haskell-temporary 1.3-130.0
haskell-texmath 0.12.0.3-40.0
haskell-text-conversions 0.3.1-62.0
haskell-text-icu 0.7.0.1-37.1
haskell-th-abstraction 0.4.2.0-2.2
haskell-th-compat 0.1-12.0
haskell-these 1.1.1.1-28.0
haskell-time-compat 1.9.5-1.0
haskell-tls 1.5.5-3.0
haskell-transformers-compat 0.6.6-3.1
haskell-typed-process 0.2.6.0-63.0
haskell-unicode-transforms 0.3.7.1-42.0
haskell-uniplate 1.6.13-4.0
haskell-unliftio-core 0.2.0.1-6.1
haskell-unordered-containers 0.2.13.0-11.0
haskell-utf8-string 1.0.1.1-20.0
haskell-uuid-types 1.0.3-58.0
haskell-vector 0.12.1.2-64.0
haskell-vector-algorithms 0.8.0.4-1.0
haskell-x509 1.7.5-137.0
haskell-x509-store 1.6.7-136.0
haskell-x509-system 1.6.6-204.0
haskell-x509-validation 1.6.11-136.0
haskell-xml 1.3.14-27.2
haskell-xml-conduit 1.9.0.0-77.0
haskell-xml-types 0.3.8-5.1
haskell-zip-archive 0.4.1-66.0
haskell-zlib 0.6.2.2-4.0
 181 PackagesBug ReportMediumLow rust 1.51.0 recompilation issues Closed
100%
Task Description
   Compiling same-file v1.0.6
     |                        ^^^
     = note: `-D non-fmt-panic` implied by `-D warnings`
     = note: this is no longer accepted in Rust 2021
help: add a "{}" format string to Display the message
     |
1493 |                 panic!("{}", out);
     |                        ^^^^^
help: or use std::panic::panic_any instead
     |
1493 |                 std::panic::panic_any(out);
     |                 ^^^^^^^^^^^^^^^^^^^^^^

Brilliantly fast changing language..

 182 Packages: StableBug ReportVery LowLow [blender] cannot resolve dependency to opensubdiv Closed
100%
Task Description

# pacman -S blender resolving dependencies… warning: cannot resolve "opensubdiv”, a dependency of "blender” :: The following package cannot be upgraded due to unresolvable dependencies:

    blender

:: Do you want to skip the above package for this upgrade? [y/N]
error: failed to prepare transaction (could not satisfy dependencies)
:: unable to satisfy dependency 'opensubdiv’ required by blender

 183 PackagesBug ReportVery LowLow [gedit] error loading shared library libtepl-5.so.0 Closed
100%
Task Description

$ gedit
gedit: error while loading shared libraries: libtepl-5.so.0: cannot open shared object file: No such file or directory

Exist extra/tepl 6.00.0-1.0 in the pacman.
I’m not sure if gedit is old or can only be used with an older version of tepl, which is not possible because i get tepl from 3 days.

 184 Packages: StableBug ReportVery LowLow [ffmpeg] error loading share library libaom.so.2 Closed
100%
Task Description

$ ffmpeg -v
ffmpeg: error while loading shared libraries: libaom.so.2: cannot open shared object file: No such file or directory

From pacman:
extra/aom 3.0.0-2.1 [installed]

 185 PackagesBug ReportMediumLow blender doesn't build Closed
100%
Task Description
- openexr missing header files?
/usr/include/openvdb/Types.h:10:10: fatal error: OpenEXR/half.h: No such file or directory
   10 | #include <OpenEXR/half.h>
      |          ^~~~~~~~~~~~~~~~
compilation terminated.

openexr 2->3 upgrade breaks blender in openvdb

openvdb needs numpy, which needs cythonize, which segfaults.
 186 PackagesBug ReportMediumLow [pacman] /etc/makeconf.conf for i486 contains flags res ...Closed
100%
Task Description

-fstack-clash-protection
-fcf-protection

We have to investiagate if one of them (or both) are
introducing illegal opcodes for i486..

 187 DevopsBug ReportMediumLow linux-pae is for x86_64? Closed
100%
Task Description

This seems to be a problem of either update-archlinux32-package in devops or of the (commented) code path in the PKGBUILD which gets executed by this script.

 188 PackagesBug ReportMediumLow [gdal] python bindings don't build on i486 (stack smash ...Closed
100%
Task Description
#0  0xb79a0c6d in raise () from /usr/lib/libc.so.6
#1  0xb79892c6 in abort () from /usr/lib/libc.so.6
#2  0xb79e449c in __libc_message () from /usr/lib/libc.so.6
#3  0xb7a6ff4c in __fortify_fail () from /usr/lib/libc.so.6
#4  0xb7a6ff19 in __stack_chk_fail () from /usr/lib/libc.so.6
#5  0xb7182004 in ?? ()
   from /usr/lib/python3.9/site-packages/numpy/core/_multiarray_umath.cpython-39-i386-linux-gnu.so
#6  0xb7179c87 in ?? ()
   from /usr/lib/python3.9/site-packages/numpy/core/_multiarray_umath.cpython-39-i386-linux-gnu.so
#7  0xb6fd589a in PyInit__multiarray_umath ()
   from /usr/lib/python3.9/site-packages/numpy/core/_multiarray_umath.cpython-39-i386-linux-gnu.so
#8  0xb7d07f35 in ?? () from /usr/lib/libpython3.9.so.1.0
#9  0xb7c37301 in ?? () from /usr/lib/libpython3.9.so.1.0
#10 0xb7c46897 in PyObject_Call () from /usr/lib/libpython3.9.so.1.0
#11 0xb7c2c557 in _PyEval_EvalFrameDefault () from /usr/lib/libpython3.9.so.1.0
#12 0xb7c260b9 in ?? () from /usr/lib/libpython3.9.so.1.0
#13 0xb7c36b05 in _PyFunction_Vectorcall () from /usr/lib/libpython3.9.so.1.0
#14 0xb7c2b4e5 in _PyEval_EvalFrameDefault () from /usr/lib/libpython3.9.so.1.0
#15 0xb7c36938 in _PyFunction_Vectorcall () from /usr/lib/libpython3.9.so.1.0
#16 0xb7c2794c in _PyEval_EvalFrameDefault () from /usr/lib/libpython3.9.so.1.0
#17 0xb7c36938 in _PyFunction_Vectorcall () from /usr/lib/libpython3.9.so.1.0
#18 0xb7c2774a in _PyEval_EvalFrameDefault () from /usr/lib/libpython3.9.so.1.0
#19 0xb7c36938 in _PyFunction_Vectorcall () from /usr/lib/libpython3.9.so.1.0
#20 0xb7c2774a in _PyEval_EvalFrameDefault () from /usr/lib/libpython3.9.so.1.0

Builds fine on i686 and pentium4, so I suspect a i486 issue in numpy.

 189 PackagesBug ReportMediumLow [mutter] test segfaults Closed
100%
Task Description
 50/105 mutter:clutter+clutter/conform / actor-clone                                                   FAIL            0.13s   killed by signal 11 SIGSEGV
 55/105 mutter:clutter+clutter/conform / actor-layout                                                  FAIL            0.13s   killed by signal 11 SIGSEGV
 61/105 mutter:clutter+clutter/conform / actor-shader-effect                                           FAIL            0.13s   killed by signal 11 SIGSEGV
 70/105 mutter:clutter+clutter/conform / timeline                                                      FAIL            0.12s   killed by signal 11 SIGSEGV
 71/105 mutter:clutter+clutter/conform / timeline-interpolate                                          FAIL            1.63s   killed by signal 11 SIGSEGV
 73/105 mutter:clutter+clutter/conform / timeline-rewind                                               FAIL            0.12s   killed by signal 11 SIGSEGV
 83/105 mutter:core+mutter/stacking / closed-transient-no-input-parent-delayed-focus-default-cancelled FAIL            0.14s   killed by signal 11 SIGSEGV
 84/105 mutter:core+mutter/stacking / closed-transient-no-input-parents                                FAIL            0.13s   killed by signal 11 SIGSEGV
104/105 mutter:core+mutter/ref-test/sanity / ref-test-sanity                                           FAIL            0.13s   killed by signal 11 SIGSEGV

For now I’m just ignoring test results.

 190 Packages: StableBug ReportVery LowCritical mpv-1:0.33.1-2.0-pentium4 aborts immediately Closed
100%
Task Description

Here’s 1:0.33.1-1.0-pentium4:

$ pacman -Qs mpv
local/mpv 1:0.33.1-1.0
    a free, open source, and cross-platform media player

$ mpv --version
mpv 0.33.1-dirty Copyright © 2000-2020 mpv/MPlayer/mplayer2 projects
 built on UNKNOWN
FFmpeg library versions:
   libavutil       56.51.100
   libavcodec      58.91.100
   libavformat     58.45.100
   libswscale      5.7.100
   libavfilter     7.85.100
   libswresample   3.7.100
FFmpeg version: n4.3.2

Here’s 1:0.33.1-2.0-pentium4:

$ pacman -Qs mpv
local/mpv 1:0.33.1-2.0
    a free, open source, and cross-platform media player

$ mpv --msg-level=all=trace --version
libavutil: 56.70.100 -> 56.51.100
Aborted (core dumped)

Looks to me like it might be a library version thing (I’m up-to-date according to

pacman -Syu

), but I’ve only been running Arch32 for 24 hours so I’m not sure where further to dig.

 191 PackagesBug ReportVery LowCritical mpv links against libsrt.so.1 which does not exist Closed
100%
Task Description
$ pacman -Qs mpv
local/mpv 1:0.33.1-1.0
    a free, open source, and cross-platform media player
$ pacman -Qs srt
local/srt 1.4.3-1.0
    Secure Reliable Transport library
$ pacman -Fl srt | grep libsrt
srt usr/lib/libsrt.so
srt usr/lib/libsrt.so.1.4
srt usr/lib/libsrt.so.1.4.3
$ mpv
mpv: error while loading shared libraries: libsrt.so.1: cannot open shared object file: No such file or directory
$ ldd /usr/bin/mpv | grep srt
	libsrt.so.1 => not found
$ sudo ln -s /usr/lib/libsrt.so.1.4.3 /usr/lib/libsrt.so.1
$ mpv --version
mpv 0.33.1-dirty Copyright © 2000-2020 mpv/MPlayer/mplayer2 projects
 built on UNKNOWN
FFmpeg library versions:
   libavutil       56.51.100
   libavcodec      58.91.100
   libavformat     58.45.100
   libswscale      5.7.100
   libavfilter     7.85.100
   libswresample   3.7.100
FFmpeg version: n4.3.2

$ ldd /usr/bin/mpv | grep srt
	libsrt.so.1 => /usr/lib/libsrt.so.1 (0xb2a54000)

Running ldconfig does not create the missing symlink.

 192 PackagesBug ReportVery LowHigh [postgis] not satisfiable dependency: "libproj.so.22" Closed
100%
Task Description

The postgis package version 3.1.1-1.0 on pentium4 does not work because only
libproj-1.5.so is installed, and not the required libproj-2.2.so.

On upstream there seems to have been some rebuild of newer versions of gdal 3.2.2 and proj 8.0.0:
https://archlinux.org/todo/gdal-322-and-proj-800-rebuild/

 193 Packages: StableBug ReportMediumLow pacman does not recognize sse2 on via processor Closed
100%
Task Description

/proc/cpuinfo:
processor : 0
vendor_id : CentaurHauls
cpu family : 6
model : 15
model name : VIA Nano U3400@800MHz
stepping : 10
cpu MHz : 798.016
cache size : 2048 KB
physical id : 0
siblings : 1
core id : 0
cpu cores : 1
apicid : 0
initial apicid : 0
fdiv_bug : no
f00f_bug : no
coma_bug : no
fpu : yes
fpu_exception : yes
cpuid level : 10
wp : yes
flags : fpu vme de pse tsc msr pae mce cx8 apic sep mtrr pge mca cmov pat clflush acpi mmx fxsr sse sse2 ss tm syscall nx lm constant_tsc arch_perfmon rep_good cpuid pni monitor vmx est tm2 ssse3 cx16 xtpr sse4_1 popcnt rng rng_en ace ace_en ace2 phe phe_en pmm pmm_en lahf_lm tpr_shadow vnmi vpid ida
vmx flags : vnmi tsc_offset vtpr
bugs : cpu_meltdown spectre_v1 spectre_v2 spec_store_bypass l1tf mds swapgs itlb_multihit
bogomips : 1596.53
clflush size : 64
cache_alignment : 128
address sizes : 36 bits physical, 48 bits virtual
power management:

Other machine, also with via processor:

/proc/cpuinfo:
processor : 0
vendor_id : CentaurHauls
cpu family : 6
model : 13
model name : VIA C7-D Processor 1800MHz
stepping : 0
cpu MHz : 1596.326
cache size : 128 KB
physical id : 0
siblings : 1
core id : 0
cpu cores : 1
apicid : 0
initial apicid : 0
fdiv_bug : no
f00f_bug : no
coma_bug : no
fpu : yes
fpu_exception : yes
cpuid level : 1
wp : yes
flags : fpu vme de pse tsc msr pae mce cx8 apic sep mtrr pge cmov pat clflush acpi mmx fxsr sse sse2 tm nx cpuid pni est tm2 xtpr rng rng_en ace ace_en ace2 ace2_en phe phe_en pmm pmm_en
bugs : cpu_meltdown spectre_v1 spectre_v2 spec_store_bypass l1tf mds swapgs itlb_multihit
bogomips : 3193.67
clflush size : 64
cache_alignment : 64
address sizes : 36 bits physical, 32 bits virtual
power management:

All the __builtin_cpu_supports() and __builtin_cpu_is() tests fail. Thus, pacman thinks, it’s not capable of sse2 and installs i686 packages instead of pentium4 ones.

Should we complain at gcc upstream? How does the kernel compile this line in /proc/cpuinfo? What checks does it perform?

 194 PackagesBug ReportVery LowLow go 1.16 doesn't build. Closed
100%
Task Description

The go build fails with this error:

unsupported setting GO386=387. Consider using GO386=softfloat instead.

go tool dist: FAILED: /build/go/src/go/pkg/tool/linux_386/compile -std -pack -o /tmp/go-tool-dist-250139381/runtime/internal/atomic/_go_.a -p runtime/internal/atomic -importcfg /tmp/go-tool-dist-250139381/runtime/internal/atomic/importcfg -asmhdr /tmp/go-tool-dist-250139381/runtime/internal/atomic/go_asm.h -symabis /tmp/go-tool-dist-250139381/runtime/internal/atomic/symabis /build/go/src/go/src/runtime/internal/atomic/atomic_386.go /build/go/src/go/src/runtime/internal/atomic/stubs.go /build/go/src/go/src/runtime/internal/atomic/unaligned.go: exit status 1
go tool dist: open /tmp/go-tool-dist-250139381/runtime/internal/atomic/_go_.a: no such file or directory
go tool dist: open /tmp/go-tool-dist-250139381/runtime/internal/sys/_go_.a: no such file or directory
go tool dist: open /tmp/go-tool-dist-250139381/internal/cpu/_go_.a: no such file or directory
unsupported setting GO386=387. Consider using GO386=softfloat instead.

go tool dist: FAILED: /build/go/src/go/pkg/tool/linux_386/compile -std -pack -o /tmp/go-tool-dist-250139381/internal/cpu/_go_.a -p internal/cpu -importcfg /tmp/go-tool-dist-250139381/internal/cpu/importcfg -asmhdr /tmp/go-tool-dist-250139381/internal/cpu/go_asm.h -symabis /tmp/go-tool-dist-250139381/internal/cpu/symabis /build/go/src/go/src/internal/cpu/cpu.go /build/go/src/go/src/internal/cpu/cpu_386.go /build/go/src/go/src/internal/cpu/cpu_x86.go: exit status 1
unsupported setting GO386=387. Consider using GO386=softfloat instead.

go tool dist: FAILED: /build/go/src/go/pkg/tool/linux_386/compile -std -pack -o /tmp/go-tool-dist-250139381/runtime/internal/sys/_go_.a -p runtime/internal/sys -importcfg /tmp/go-tool-dist-250139381/runtime/internal/sys/importcfg -asmhdr /tmp/go-tool-dist-250139381/runtime/internal/sys/go_asm.h -symabis /tmp/go-tool-dist-250139381/runtime/internal/sys/symabis /build/go/src/go/src/runtime/internal/sys/arch.go /build/go/src/go/src/runtime/internal/sys/arch_386.go /build/go/src/go/src/runtime/internal/sys/intrinsics_common.go /build/go/src/go/src/runtime/internal/sys/intrinsics_stubs.go /build/go/src/go/src/runtime/internal/sys/stubs.go /build/go/src/go/src/runtime/internal/sys/sys.go /build/go/src/go/src/runtime/internal/sys/zgoarch_386.go /build/go/src/go/src/runtime/internal/sys/zgoos_linux.go /build/go/src/go/src/runtime/internal/sys/zversion.go: exit status 1
=⇒ ERROR: A failure occurred in build().

  Aborting...

Upstream discussion about this bug: https://github.com/golang/go/issues/44500

Someone mentions a fix, but it doesn’t apply for non SSE2 devices.

 195 Packages: TestingBug ReportVery LowLow libreoffice-fresh and libreoffice-still will not start  Closed
100%
Task Description

There is a problem with libreoffice-fresh and libreoffice-still which appears to be caused by the last update to boost and boost-libs which are now at version 1.76.0-1.3

~]$ libreoffice
javaldx: Could not find a Java Runtime Environment!
Warning: failed to read path from javaldx
/usr/lib/libreoffice/program/soffice.bin: error while loading shared libraries: libboost_locale.so.1.75.0: cannot open shared object file: No such file or directory
 198 PackagesBug ReportVery LowCritical [deleted due to spam] Closed
100%
Task Description

no task description

 199 PackagesBug ReportVery LowLow SPAM Closed
100%
Task Description

SPAM

 200 PackagesBug ReportVery LowLow SPAM Closed
100%
Task Description

SPAM

 201 PackagesBug ReportVery LowLow SPAM Closed
100%
Task Description

SPAM

 202 PackagesBug ReportVery LowLow SPAM Closed
100%
Task Description

SPAM

 203 PackagesBug ReportVery LowLow SPAM Closed
100%
Task Description

SPAM

 204 PackagesBug ReportMediumLow gdbm 1.21 fails in test 31 (convert new database format ...Closed
100%
Task Description

The bug report has been sent upstream to GDBM directly. This is too important to just ignore the failure.. (make check || true)

 205 PackagesBug ReportVery LowLow SPAM Closed
100%
Task Description

no task description

 206 PackagesBug ReportVery LowLow SPAM Closed
100%
Task Description

no task description

 211 PackagesBug ReportVery LowMedium asp32 Closed
100%
Task Description

asp32 fails to export/checkout anything.

Esample:

# asp32 export pacman
fatal: unable to update url base from redirection:

asked for: https://git.archlinux.org/svntogit/packages.git/info/refs?service=git-upload-pack
 redirect: https://gitlab.archlinux.org/explore/groups

error: failed to update remote packages64

 212 PackagesBug ReportVery LowHigh libblockdev issue with glibc Closed
100%
Task Description

Trying to start udisks2 daemon (systemctl start udisks2.service) fails because of a library issue.

/usr/lib/udisks2/udisksd: symbol lookup error: /usr/lib/libbd_utils.so.2: undefined symbol: g_spawn_check_wait_status

Maybe libblockdev needs to be recompiled with the right glibc version.

Thus, it is not possible to auto-mount external USB drives.

 213 PackagesBug ReportMediumLow [libffi] libffi.so7/libffi.so.8 major ABI bump Closed
100%
Task Description

make and guile made it half (and broken) to stable.
breaking the cycle required a shim package libffi33 in build-support.
packages depending of libffi are rescheduled and need to be rebuilt first, pushing libffi.so.8 to stable now would make
‘make/guile’ work again, but break a lot of other stuff!

 215 PackagesBug ReportMediumLow firefox 93.0 (and seamonkey 2.53.9.1) doesn't build Closed
100%
Task Description
 2:52.15 error: `[u32; 2]` is forbidden as the type of a const generic parameter
 2:52.15   --> /build/firefox/src/firefox-93.0/third_party/rust/packed_simd/src/codegen/llvm.rs:20:44
 2:52.15    |
 2:52.15 20 | pub unsafe fn __shuffle_vector2<const IDX: [u32; 2], T, U>(x: T, y: T) -> U
 2:52.15    |                                            ^^^^^^^^
 2:52.15    |
 2:52.15    = note: the only supported types are integers, `bool` and `char`
 2:52.15    = help: more complex types are supported with `#![feature(adt_const_params)]`
 2:52.15 error: `[u32; 4]` is forbidden as the type of a const generic parameter
 2:52.15   --> /build/firefox/src/firefox-93.0/third_party/rust/packed_simd/src/codegen/llvm.rs:30:44
 2:52.15    |
 2:52.15 30 | pub unsafe fn __shuffle_vector4<const IDX: [u32; 4], T, U>(x: T, y: T) -> U
 2:52.15    |                                            ^^^^^^^^
 2:52.15    |
 2:52.15    = note: the only supported types are integers, `bool` and `char`
 2:52.15    = help: more complex types are supported with `#![feature(adt_const_params)]`
 2:52.15 error: `[u32; 8]` is forbidden as the type of a const generic parameter
 2:52.15   --> /build/firefox/src/firefox-93.0/third_party/rust/packed_simd/src/codegen/llvm.rs:40:44
 2:52.15    |
 2:52.15 40 | pub unsafe fn __shuffle_vector8<const IDX: [u32; 8], T, U>(x: T, y: T) -> U
 2:52.15    |                                            ^^^^^^^^
 2:52.15    |
 2:52.15    = note: the only supported types are integers, `bool` and `char`
 2:52.15    = help: more complex types are supported with `#![feature(adt_const_params)]`
 2:52.15 error: `[u32; 16]` is forbidden as the type of a const generic parameter
 2:52.15   --> /build/firefox/src/firefox-93.0/third_party/rust/packed_simd/src/codegen/llvm.rs:50:45
 2:52.15    |
 2:52.15 50 | pub unsafe fn __shuffle_vector16<const IDX: [u32; 16], T, U>(x: T, y: T) -> U
 2:52.15    |                                             ^^^^^^^^^
 2:52.15    |
 2:52.15    = note: the only supported types are integers, `bool` and `char`
 2:52.15    = help: more complex types are supported with `#![feature(adt_const_params)]`
 2:52.15 error: `[u32; 32]` is forbidden as the type of a const generic parameter
 2:52.15   --> /build/firefox/src/firefox-93.0/third_party/rust/packed_simd/src/codegen/llvm.rs:60:45
 2:52.15    |
 2:52.15 60 | pub unsafe fn __shuffle_vector32<const IDX: [u32; 32], T, U>(x: T, y: T) -> U
 2:52.15    |                                             ^^^^^^^^^
 2:52.15    |
 2:52.15    = note: the only supported types are integers, `bool` and `char`
 2:52.15    = help: more complex types are supported with `#![feature(adt_const_params)]`
 2:52.15 error: `[u32; 64]` is forbidden as the type of a const generic parameter
 2:52.15   --> /build/firefox/src/firefox-93.0/third_party/rust/packed_simd/src/codegen/llvm.rs:70:45
 2:52.15    |
 2:52.15 70 | pub unsafe fn __shuffle_vector64<const IDX: [u32; 64], T, U>(x: T, y: T) -> U
 2:52.15    |                                             ^^^^^^^^^
 2:52.15    |
 2:52.15    = note: the only supported types are integers, `bool` and `char`
 2:52.15    = help: more complex types are supported with `#![feature(adt_const_params)]`
 2:52.35    Compiling num_cpus v1.13.0
 2:53.13    Compiling fluent-langneg v0.13.0
 2:53.15    Compiling intl_pluralrules v7.0.1
 2:53.59    Compiling intl-memoizer v0.5.1
 2:55.32    Compiling gl_generator v0.14.0
 2:55.37    Compiling cose-c v0.1.5
 2:55.96    Compiling time v0.1.43
 2:56.01    Compiling iovec v0.1.4
 2:56.05    Compiling atty v0.2.14
 2:56.21 For more information about this error, try `rustc --explain E0557`.
 2:56.23    Compiling net2 v0.2.37
 2:56.24 The following warnings were emitted during compilation:
 2:56.25 warning: Cannot set `RUSTC_BOOTSTRAP=1` from build script of `packed_simd v0.3.4 (https://github.com/hsivonen/packed_simd?rev=6a16f954950401b92b4e220fbf2dfaf6f00e1fb2#6a16f954)`.
 2:56.25 note: Crates cannot set `RUSTC_BOOTSTRAP` themselves, as doing so would subvert the stability guarantees of Rust for your project.
 2:56.25 error: could not compile `packed_simd` due to 13 previous errors
 2:56.25 warning: build failed, waiting for other jobs to finish...
 3:17.66 error: build failed
 217 PackagesBug ReportMediumLow [llvm12] shim needed Closed
100%
Task Description

librsvg/rust fails because llvm is now 13 and we don’t have the llvm12-libs around anymore.
Will make a shim package.

 218 PackagesBug ReportMediumLow [nss] shlibsign segfaults on IA-32 Closed
100%
Task Description

subprocess.CalledProcessError: Command ‘[’/build/nss/src/dist/Release/bin/shlibsign’, ‘-v’, ‘-i’, ‘/build/nss/src/dist/Release/lib/libfreebl3.so’]’ died with <Signals.SIGSEGV: 11>.

 219 PackagesBug ReportVery LowLow [postgresql] and [postgresql-old-upgrade] links against ...Closed
100%
Task Description

After my most recent sysupgrade, postgresql refuses to start. The main postgres binary appears to be linked to multiple versions of libicu:

$  ldd /usr/bin/postgres | grep icu
	libicui18n.so.69 => /usr/lib/libicui18n.so.69 (0xb6c00000)
	libicuuc.so.69 => /usr/lib/libicuuc.so.69 (0xb6a0c000)
	libicuuc.so.70 => /usr/lib/libicuuc.so.70 (0xb6582000)
	libicudata.so.69 => /usr/lib/libicudata.so.69 (0xb4601000)
	libicudata.so.70 => /usr/lib/libicudata.so.70 

(0xb27a4000)

Installing the icu69 compatibility package made it work again, but it doesn’t look right that it should link against multiple versions.

 220 PackagesBug ReportVery HighCritical [python] completly broken Closed
100%
Task Description

Traceback (most recent call last):

File "/usr/lib/python3.9/site-packages/mercurial/policy.py", line 69, in _importfrom
  fakelocals[modname] = mod = getattr(pkg, modname)
File "/usr/lib/python3.9/site-packages/mercurial/pycompat.py", line 307, in w
  return f(object, sysstr(name), *args)

AttributeError: module ‘mercurial.cext’ has no attribute ‘parsers’

During handling of the above exception, another exception occurred:

Traceback (most recent call last):

File "/usr/bin/hg", line 61, in <module>
  dispatch.run()
File "/usr/lib/python3.10/importlib/util.py", line 247, in __getattribute__
  self.__spec__.loader.exec_module(self)
File "<frozen importlib._bootstrap_external>", line 883, in exec_module
File "<frozen importlib._bootstrap>", line 241, in _call_with_frames_removed
File "/usr/lib/python3.9/site-packages/mercurial/dispatch.py", line 21, in <module>
  from .i18n import _
File "/usr/lib/python3.10/importlib/util.py", line 247, in __getattribute__
  self.__spec__.loader.exec_module(self)
File "/usr/lib/python3.9/site-packages/mercurial/i18n.py", line 123, in <module>
  if _plain():
File "/usr/lib/python3.9/site-packages/mercurial/i18n.py", line 115, in _plain
  b'HGPLAIN' not in encoding.environ
File "/usr/lib/python3.10/importlib/util.py", line 247, in __getattribute__
  self.__spec__.loader.exec_module(self)
File "/usr/lib/python3.9/site-packages/mercurial/encoding.py", line 41, in <module>
  charencode = policy.importmod('charencode')
File "/usr/lib/python3.9/site-packages/mercurial/policy.py", line 116, in importmod
  mod = _importfrom(pn, mn)
File "/usr/lib/python3.9/site-packages/mercurial/policy.py", line 71, in _importfrom
  raise ImportError('cannot import name %s' % modname)

ImportError: cannot import name parsers

for instance when building nss.

 221 Packages: TestingBug ReportVery LowCritical [exim] / is stuck in testing since a month Closed
100%
Task Description

Hi!

I just mentioned that exim stopped sending me emails… So I just upgraded to the package in community-testing… And now exim sends me emails, that complain about things like this:
“warning: exim: local (4.95-2.0) is newer than community (4.95-1.0)” LOL

Is there a reason, that the fresh package is being tested since a month now?

Thx.

Bye.

 222 PackagesBug ReportVery LowLow GNOME broken on pentium4 Closed
100%
Task Description

I’m getting a “BadAccess” Xorg error. I think this is happening because the packaged version has been compiled against libraries which have meanwhile been upgraded.

Just to get to this point I had to install “libldap24” and “libffi7”.

 223 PackagesBug ReportVery LowLow asp32 is broken Closed
100%
Task Description

It needs to be updated to reflect the switch to gitlab.archlinux.org

 224 PackagesBug ReportVery LowCritical gpg broken on pentium4 Closed
100%
Task Description

I had to rebuild sqlite to have dirmng start and still –recv-keys is not working, returning “general error”.

 225 PackagesBug ReportHighCritical [zstd] 1.5.1, zstd compressed ramdisk fails to load pro ...Closed
100%
Task Description

kernel issue with some network card and/or
systemd subservice not working add all

I cannot login remotely or locally.

System drops to maintainance shell..

Not a single systemd subdaemon is working..

This also effectively kills all i486 build machines..

 226 PackagesBug ReportVery LowLow claws-mail needs to be recompiled on i686 Closed
100%
Task Description

On i686, with testing and without testing claws mail is broken:
$ claws-mail
claws-mail: error while loading shared libraries: liblber-2.4.so.2: cannot open shared object file: No such file or directory

While I run Parabola i686, the repositories being used come from Archlinux 32:
$ pacman -sS claws-mail
extra/claws-mail 4.0.0-2.0 [installed]

  A GTK+ based e-mail client

$ pacman -Q -o /usr/lib/liblber*
/usr/lib/liblber.so is owned by libldap 2.6.0-2.4
/usr/lib/liblber.so.2 is owned by libldap 2.6.0-2.4
/usr/lib/liblber.so.2.0.200 is owned by libldap 2.6.0-2.4
$ pacman -sS libldap
core/libldap 2.6.0-2.4 [installed]

  Lightweight Directory Access Protocol (LDAP) client libraries

$ pacman -Q -l libldap | grep /usr/lib/liblber
libldap /usr/lib/liblber.so
libldap /usr/lib/liblber.so.2
libldap /usr/lib/liblber.so.2.0.200

So it’s most probably broken on Arch Linux 32 as well.

Denis.

 227 PackagesBug ReportMediumLow [object-introspection] [libosinfo] rebuild issue Closed
100%
Task Description

affects: tracker-miners tracker3-miners gnome-documents gnome-music gnome-photos nautilus

 229 PackagesBug ReportVery LowLow SPAM Closed
100%
Task Description

no task description

 230 PackagesBug ReportVery LowLow [SPAM] Closed
100%
Task Description

no task description

 232 PackagesBug ReportVery LowLow clementine fails on missing libprotobuf.so.27 Closed
100%
Task Description

After just having updated my trusty EeePC 1000H to be fully up to date again, I discovered that clementine is no longer working. It fails, stating that libprotobuf.so.27 cannot be found. Looking in /usr/lib, I can see libprotobuf.so.28, so I assume that the clementine package needs a rebuild.

 233 PackagesBug ReportVery LowLow Cannot install smplayer due to broken dependency Closed
100%
Task Description

I am currently unable to install smplayer in testing due to a broken dependency of mpv

[~]$ sudo pacman -S smplayer
resolving dependencies...
warning: cannot resolve "libplacebo.so=120-32", a dependency of "mpv"
warning: cannot resolve "mpv", a dependency of "smplayer"
:: The following package cannot be upgraded due to unresolvable dependencies:
      smplayer

:: Do you want to skip the above package for this upgrade? [y/N] y
looking for conflicting packages...
 there is nothing to do
 234 PackagesBug ReportMediumLow [xlockmore] just segfaults when started Closed
100%
Task Description

no task description

 235 PackagesBug ReportVery LowLow fluxbox segfaults Closed
100%
Task Description

no task description

Showing tasks 151 - 200 of 349 Page 4 of 7<<First - 2 - 3 - 4 - 5 - 6 - Last >>

Available keyboard shortcuts

Tasklist

Task Details

Task Editing