Bugs in Archlinux32 packages, specific to 32-bit issues.

Bugs  FS#2  to  FS#92  have been recovered and may be incomplete, the
recovered Google/Bing cache data can be found here.

IDCategory  ascTask TypePrioritySeveritySummaryStatusProgress
254PackagesBug ReportMediumLow[libinput/libadwaita/gtk4/tracker3] on i486 failNew
0%
Task Description
/usr/bin/ld: warning: libicuuc.so.69, needed by /usr/lib/libtracker-sparql-3.0.so, not found (try using -rpath or -rpath-link)
/usr/bin/ld: warning: libicui18n.so.69, needed by /usr/lib/libtracker-sparql-3.0.so, not found (try using -rpath or -rpath-link)
/usr/bin/ld: /usr/lib/libtracker-sparql-3.0.so: undefined reference to `unorm2_getNFKCInstance_69'
/usr/bin/ld: /usr/lib/libtracker-sparql-3.0.so: undefined reference to `u_strToLower_69'
/usr/bin/ld: /usr/lib/libtracker-sparql-3.0.so: undefined reference to `ubrk_first_69'

tracker3 is not rebuilding on i486:

tracker/docs/reference/libtracker-sparql/meson.build:78:7: ERROR: Unknown variable "tracker_sparql_gir".
 253 PackagesBug ReportMediumLow [rust] rebuilds but fails to build anything Closed
100%
Task Description

Bootstrapping rust via rust159-bin leads to:

error[E0463]: can't find crate for `std`

error[E0463]: can't find crate for `core`

error[E0463]: can't find crate for `compiler_builtins`

Basically, rust is broken.

252PackagesBug ReportMediumLow[dbus-python/python-dbus] mixupNew
0%
Task Description

packages (like upower) which include a dependency on python-dbus
use a 3.9 version and miss the correct one dbus-python (which
replaces python-dbus). This will only solve itself when upstream
adapts the PKGBUILDs to this name change.

 250 PackagesBug ReportMediumLow [luajit] Illegal instruction on i686, i486 Closed
100%
Task Description

Happens for instance when starting mpv.

 249 PackagesBug ReportMediumLow [ssh] strange output instead of scp Closed
100%
Task Description
scp -rC user@server:directory .
\033[?2004lD0711 0 directory

Enabling -vvv just makes scp hang.

No clue, what the problem could be here..

248PackagesBug ReportMediumLow[Qt6] Illegal OpcodesNew
0%
Task Description
кві 09 19:43:36 alizee kernel: traps: telegram-deskto[1252] trap invalid opcode ip:b3f990c3 sp:bf8d0010 error:0 in libQt6Gui.so.6.2.3[b3ecb000+873000]

Stack trace of thread 1252:
#0  0x00000000b3f990c3 n/a (libQt6Gui.so.6 + 0xce0c3)
#1  0x00000000b7f67ecb call_init (ld-linux.so.2 + 0x5ecb)
#2  0x00000000b7f67fc4 _dl_init (ld-linux.so.2 + 0x5fc4)
#3  0x00000000b7f7f58a _dl_start_user (ld-linux.so.2 + 0x1d58a)
ELF object binary architecture: Intel 80386
кві 09 19:45:11 alizee kernel: traps: qbittorrent[1353] trap invalid opcode ip:b60c69b6 sp:bfd54e70 error:0 in libQt6Core.so.6.2.3[b5f22000+2fd000]

Stack trace of thread 1353:
#0  0x00000000b60c69b6 _Z26qCalculateGrowingBlockSizeiii (libQt6Core.so.6 + 0x21c9b6)
#1  0x00000000b60c6aa9 _ZN10QArrayData8allocateEPPS_iiiNS_16AllocationOptionE (libQt6Core.so.6 + 0x21caa9)
#2  0x00000000b61e9cef n/a (libQt6Core.so.6 + 0x33fcef)
#3  0x00000000b61139a4 _ZN18QThreadStorageDataC2EPFvPvE (libQt6Core.so.6 + 0x2699a4)
#4  0x00000000b656aca9 n/a (libQt6Network.so.6 + 0x31ca9)
#5  0x00000000b7f68ecb call_init (ld-linux.so.2 + 0x5ecb)
#6  0x00000000b7f68fc4 _dl_init (ld-linux.so.2 + 0x5fc4)
#7  0x00000000b7f8058a _dl_start_user (ld-linux.so.2 + 0x1d58a)
ELF object binary architecture: Intel 80386
 247 PackagesBug ReportMediumLow [freetype2] requires librsvg >= 2.46.0 Closed
100%
Task Description

This could be bad because our librsvg (the Rust one) lags behind and librsvg-og might not
implement new stuff (for i486).

246PackagesBug ReportMediumLow[blender] doesn't work (and doesn't build)New
0%
Task Description

blender 2.93 has dependencies on wrong versions of
- llvm (via openshadinglanguage)
- boost (via openimageio)

Could NOT find PythonLibsUnix (missing: PYTHON_LIBRARY PYTHON_LIBPATH PYTHON_INCLUDE_DIR PYTHON_INCLUDE_CONFIG_DIR)’

blender 3.0.1:
Haru not found, disabling WITH_HARU’ and ‘Cycles OSL requires WITH_LLVM, the library may not have been found. Configure LLVM or disable WITH_CYCLES_OSL

Let’s tackle one issue after the other. :-)

245PackagesBug ReportMediumLow[opencv] Python stack smashingNew
0%
Task Description

– Found PythonInterp: /usr/bin/python3 (found suitable version “3.10.4”, minimum required is “3.2”)
– Found PythonLibs: /lib/libpython3.10.so (found suitable exact version “3.10.4”)
* stack smashing detected *: terminated

Building falls through, only in package() we see the errors then:

rm: cannot remove ‘/build/opencv/pkg/opencv/usr/lib/python3*’: No such file or directory
=⇒ ERROR: A failure occurred in package_opencv().

Happens on real i486, not in staging-i486-build, making it even more annoying.

This blocks gstreamer with the opencv plugin..

 244 PackagesBug ReportVery LowLow unable to satisfy dependency 'libx264.so=163-32' requir ...Closed
100%
Task Description

# pacman -Sy ffmpeg
:: Synchronizing package databases… core is up to date
extra is up to date
community is up to date
resolving dependencies… warning: cannot resolve “libx264.so=163-32”, a dependency of “ffmpeg” :: The following package cannot be upgraded due to unresolvable dependencies:

    ffmpeg
243PackagesBug ReportVery LowMedium[linux and linux-zen] 5.16.12 needs a rebuild with gcc...New
0%
Task Description

[linux and linux-zen] 5.16.12 needs a rebuild with gcc 11.2 so DKMS packages will work

get errors when dkms installing in make log

cc1: error: incompatible gcc/plugin versions
cc1: error: failed to initialize plugin ./scripts/gcc-plugins/structleak_plugin.so

 242 PackagesBug ReportMediumLow [flac] fails to build Closed
100%
Task Description

This is just the sad state of what people do to working software:

if(CMAKE_SYSTEM_PROCESSOR STREQUAL "i686" AND HAVE_STACKREALIGN_FLAG)
    add_compile_options(-mstackrealign)
endif()

which results in nasm to fail with “unknown option -m”

a) they rewrite half of the build system without apparently understanding fully the autoconf part
b) they don’t bother to delete to autoconf part
c) they write code for porting the software apparenty without testing (why bother then in the first place?)

 241 PackagesBug ReportVery LowLow mpd probably needs to be rebuilt against pipewire Closed
100%
Task Description

Hi,

If I run mpd, it fails to run due to a missing PW_LOG_TOPIC_DEFAULT symbol:
> $ mpd
> mpd: symbol lookup error: mpd: undefined symbol: PW_LOG_TOPIC_DEFAULT

While I run Parabola, both mpd and pipewire comes from the i686 repository of Arch Linux 32:
> extra/mpd 0.23.5-1.2 [installed]
> Flexible, powerful, server-side application for playing music
> extra/pipewire 1:0.3.36-1.0 [installed]
> Low-latency audio/video router and processor

If I look on a x86_64 Parabola installation instead, PW_LOG_TOPIC_DEFAULT can be found in libpipewire:
> $ readelf -s /usr/lib/libpipewire-0.3.so.0 | grep PW_LOG_
> 383: 00000000000d7128 8 OBJECT GLOBAL DEFAULT 21 > PW_LOG_TOPIC_DEFAULT

But that command returns nothing on Parabola i686.

Denis.

240PackagesBug ReportMediumLow[qt5-base] i486 builds run out of memory due to LTONew
0%
Task Description

LTO is hard to switch off, there are flags doing nothing, I see errors like

lto-wrapper: fatal error: write: No space left on device

 239 PackagesBug ReportMediumLow [ffmpeg] and [ffmepg4.4] fail to build Closed
100%
Task Description
libswscale/x86/rgb2rgb_template.c: In function ‘interleaveBytes_sse2’:
libswscale/x86/rgb2rgb_template.c:1838:9: error: the register ‘xmm2’ cannot be clobbered in ‘asm’ for the current target
 1838 |         __asm__(
      |         ^

Also on i486 symbols are missing if not using LTO and probing of libraries like x264/x265 fail.

 238 PackagesBug ReportVery LowLow Linux-zen kernel 5.16.8.arch1-1.0 made with gcc 11.1 an ...Closed
100%
Task Description

Linux and Linux-zen kernel 5.16.8.arch1-1.0 made with gcc 11.1 and cannot build dkms modules with gcc 11.2

remake linux and linux-zen kernel with gcc version 11.2

 237 PackagesBug ReportVery LowLow i686: pango need to be rebuilt against harfbuzz Closed
100%
Task Description

Hi,

pango-list (and many packages depending on pango) fails to run with the following error:

$ pango-list 
pango-list: symbol lookup error: /usr/lib/libpangoft2-1.0.so.0: undefined symbol: hb_font_set_synthetic_slant

hb_font_set_synthetic_slant seems to be related to harfbuzz.

While I used Parabola i686 for the test, both pango and harfbuzz come from Arch Linux 32 i686, so Arch Linux 32 i686 should also be affected:

$ pacman -Q -o pango-list 
/usr/bin/pango-list is owned by pango 1:1.50.4-1.0
$ pacman -sS "^pango$"
extra/pango 1:1.50.4-1.0 [installed]
    A library for layout and rendering of text
$ pacman -sS "^harfbuzz$"
extra/harfbuzz 3.1.2-1.0 [installed]
    OpenType text shaping engine

Denis.

 236 PackagesBug ReportVery LowLow gdb: error while loading shared libraries: libboost_reg ...Closed
100%
Task Description

Current version in /usr/lib is libboost_regex.so.1.78.0

 235 PackagesBug ReportVery LowLow fluxbox segfaults Closed
100%
Task Description

no task description

 234 PackagesBug ReportMediumLow [xlockmore] just segfaults when started Closed
100%
Task Description

no task description

 233 PackagesBug ReportVery LowLow Cannot install smplayer due to broken dependency Closed
100%
Task Description

I am currently unable to install smplayer in testing due to a broken dependency of mpv

[~]$ sudo pacman -S smplayer
resolving dependencies...
warning: cannot resolve "libplacebo.so=120-32", a dependency of "mpv"
warning: cannot resolve "mpv", a dependency of "smplayer"
:: The following package cannot be upgraded due to unresolvable dependencies:
      smplayer

:: Do you want to skip the above package for this upgrade? [y/N] y
looking for conflicting packages...
 there is nothing to do
 232 PackagesBug ReportVery LowLow clementine fails on missing libprotobuf.so.27 Closed
100%
Task Description

After just having updated my trusty EeePC 1000H to be fully up to date again, I discovered that clementine is no longer working. It fails, stating that libprotobuf.so.27 cannot be found. Looking in /usr/lib, I can see libprotobuf.so.28, so I assume that the clementine package needs a rebuild.

231PackagesBug ReportMediumLow[libffi] packages needing a rebuildNew
0%
Task Description
'pypy_plugin.so' -> '/build/uwsgi/pkg/uwsgi-plugin-pypy/usr/lib/uwsgi/pypy_plugin.so'
install: creating directory '/build/uwsgi/pkg/uwsgi-plugin-pypy/opt'
install: creating directory '/build/uwsgi/pkg/uwsgi-plugin-pypy/opt/pypy'
install: creating directory '/build/uwsgi/pkg/uwsgi-plugin-pypy/opt/pypy/site-packages'
'uwsgidecorators.py' -> '/build/uwsgi/pkg/uwsgi-plugin-pypy/opt/pypy/site-packages/uwsgidecorators.py'
pypy: error while loading shared libraries: libffi.so.6: cannot open shared object file: No such file or directory
 230 PackagesBug ReportVery LowLow [SPAM] Closed
100%
Task Description

no task description

 229 PackagesBug ReportVery LowLow SPAM Closed
100%
Task Description

no task description

228PackagesBug ReportMediumLow[icu69] not updated packagesNew
0%
Task Description

starting to collect them here packages which require icu69 (and have thus not been rebuilt
for icu 70 yet):

- abiword: libical (rescheduled build)

 227 PackagesBug ReportMediumLow [object-introspection] [libosinfo] rebuild issue Closed
100%
Task Description

affects: tracker-miners tracker3-miners gnome-documents gnome-music gnome-photos nautilus

 226 PackagesBug ReportVery LowLow claws-mail needs to be recompiled on i686 Closed
100%
Task Description

On i686, with testing and without testing claws mail is broken:
$ claws-mail
claws-mail: error while loading shared libraries: liblber-2.4.so.2: cannot open shared object file: No such file or directory

While I run Parabola i686, the repositories being used come from Archlinux 32:
$ pacman -sS claws-mail
extra/claws-mail 4.0.0-2.0 [installed]

  A GTK+ based e-mail client

$ pacman -Q -o /usr/lib/liblber*
/usr/lib/liblber.so is owned by libldap 2.6.0-2.4
/usr/lib/liblber.so.2 is owned by libldap 2.6.0-2.4
/usr/lib/liblber.so.2.0.200 is owned by libldap 2.6.0-2.4
$ pacman -sS libldap
core/libldap 2.6.0-2.4 [installed]

  Lightweight Directory Access Protocol (LDAP) client libraries

$ pacman -Q -l libldap | grep /usr/lib/liblber
libldap /usr/lib/liblber.so
libldap /usr/lib/liblber.so.2
libldap /usr/lib/liblber.so.2.0.200

So it’s most probably broken on Arch Linux 32 as well.

Denis.

 225 PackagesBug ReportHighCritical [zstd] 1.5.1, zstd compressed ramdisk fails to load pro ...Closed
100%
Task Description

kernel issue with some network card and/or
systemd subservice not working add all

I cannot login remotely or locally.

System drops to maintainance shell..

Not a single systemd subdaemon is working..

This also effectively kills all i486 build machines..

 224 PackagesBug ReportVery LowCritical gpg broken on pentium4 Closed
100%
Task Description

I had to rebuild sqlite to have dirmng start and still –recv-keys is not working, returning “general error”.

 223 PackagesBug ReportVery LowLow asp32 is broken Closed
100%
Task Description

It needs to be updated to reflect the switch to gitlab.archlinux.org

 222 PackagesBug ReportVery LowLow GNOME broken on pentium4 Closed
100%
Task Description

I’m getting a “BadAccess” Xorg error. I think this is happening because the packaged version has been compiled against libraries which have meanwhile been upgraded.

Just to get to this point I had to install “libldap24” and “libffi7”.

 220 PackagesBug ReportVery HighCritical [python] completly broken Closed
100%
Task Description

Traceback (most recent call last):

File "/usr/lib/python3.9/site-packages/mercurial/policy.py", line 69, in _importfrom
  fakelocals[modname] = mod = getattr(pkg, modname)
File "/usr/lib/python3.9/site-packages/mercurial/pycompat.py", line 307, in w
  return f(object, sysstr(name), *args)

AttributeError: module ‘mercurial.cext’ has no attribute ‘parsers’

During handling of the above exception, another exception occurred:

Traceback (most recent call last):

File "/usr/bin/hg", line 61, in <module>
  dispatch.run()
File "/usr/lib/python3.10/importlib/util.py", line 247, in __getattribute__
  self.__spec__.loader.exec_module(self)
File "<frozen importlib._bootstrap_external>", line 883, in exec_module
File "<frozen importlib._bootstrap>", line 241, in _call_with_frames_removed
File "/usr/lib/python3.9/site-packages/mercurial/dispatch.py", line 21, in <module>
  from .i18n import _
File "/usr/lib/python3.10/importlib/util.py", line 247, in __getattribute__
  self.__spec__.loader.exec_module(self)
File "/usr/lib/python3.9/site-packages/mercurial/i18n.py", line 123, in <module>
  if _plain():
File "/usr/lib/python3.9/site-packages/mercurial/i18n.py", line 115, in _plain
  b'HGPLAIN' not in encoding.environ
File "/usr/lib/python3.10/importlib/util.py", line 247, in __getattribute__
  self.__spec__.loader.exec_module(self)
File "/usr/lib/python3.9/site-packages/mercurial/encoding.py", line 41, in <module>
  charencode = policy.importmod('charencode')
File "/usr/lib/python3.9/site-packages/mercurial/policy.py", line 116, in importmod
  mod = _importfrom(pn, mn)
File "/usr/lib/python3.9/site-packages/mercurial/policy.py", line 71, in _importfrom
  raise ImportError('cannot import name %s' % modname)

ImportError: cannot import name parsers

for instance when building nss.

 219 PackagesBug ReportVery LowLow [postgresql] and [postgresql-old-upgrade] links against ...Closed
100%
Task Description

After my most recent sysupgrade, postgresql refuses to start. The main postgres binary appears to be linked to multiple versions of libicu:

$  ldd /usr/bin/postgres | grep icu
	libicui18n.so.69 => /usr/lib/libicui18n.so.69 (0xb6c00000)
	libicuuc.so.69 => /usr/lib/libicuuc.so.69 (0xb6a0c000)
	libicuuc.so.70 => /usr/lib/libicuuc.so.70 (0xb6582000)
	libicudata.so.69 => /usr/lib/libicudata.so.69 (0xb4601000)
	libicudata.so.70 => /usr/lib/libicudata.so.70 

(0xb27a4000)

Installing the icu69 compatibility package made it work again, but it doesn’t look right that it should link against multiple versions.

 218 PackagesBug ReportMediumLow [nss] shlibsign segfaults on IA-32 Closed
100%
Task Description

subprocess.CalledProcessError: Command ‘[’/build/nss/src/dist/Release/bin/shlibsign’, ‘-v’, ‘-i’, ‘/build/nss/src/dist/Release/lib/libfreebl3.so’]’ died with <Signals.SIGSEGV: 11>.

 217 PackagesBug ReportMediumLow [llvm12] shim needed Closed
100%
Task Description

librsvg/rust fails because llvm is now 13 and we don’t have the llvm12-libs around anymore.
Will make a shim package.

 215 PackagesBug ReportMediumLow firefox 93.0 (and seamonkey 2.53.9.1) doesn't build Closed
100%
Task Description
 2:52.15 error: `[u32; 2]` is forbidden as the type of a const generic parameter
 2:52.15   --> /build/firefox/src/firefox-93.0/third_party/rust/packed_simd/src/codegen/llvm.rs:20:44
 2:52.15    |
 2:52.15 20 | pub unsafe fn __shuffle_vector2<const IDX: [u32; 2], T, U>(x: T, y: T) -> U
 2:52.15    |                                            ^^^^^^^^
 2:52.15    |
 2:52.15    = note: the only supported types are integers, `bool` and `char`
 2:52.15    = help: more complex types are supported with `#![feature(adt_const_params)]`
 2:52.15 error: `[u32; 4]` is forbidden as the type of a const generic parameter
 2:52.15   --> /build/firefox/src/firefox-93.0/third_party/rust/packed_simd/src/codegen/llvm.rs:30:44
 2:52.15    |
 2:52.15 30 | pub unsafe fn __shuffle_vector4<const IDX: [u32; 4], T, U>(x: T, y: T) -> U
 2:52.15    |                                            ^^^^^^^^
 2:52.15    |
 2:52.15    = note: the only supported types are integers, `bool` and `char`
 2:52.15    = help: more complex types are supported with `#![feature(adt_const_params)]`
 2:52.15 error: `[u32; 8]` is forbidden as the type of a const generic parameter
 2:52.15   --> /build/firefox/src/firefox-93.0/third_party/rust/packed_simd/src/codegen/llvm.rs:40:44
 2:52.15    |
 2:52.15 40 | pub unsafe fn __shuffle_vector8<const IDX: [u32; 8], T, U>(x: T, y: T) -> U
 2:52.15    |                                            ^^^^^^^^
 2:52.15    |
 2:52.15    = note: the only supported types are integers, `bool` and `char`
 2:52.15    = help: more complex types are supported with `#![feature(adt_const_params)]`
 2:52.15 error: `[u32; 16]` is forbidden as the type of a const generic parameter
 2:52.15   --> /build/firefox/src/firefox-93.0/third_party/rust/packed_simd/src/codegen/llvm.rs:50:45
 2:52.15    |
 2:52.15 50 | pub unsafe fn __shuffle_vector16<const IDX: [u32; 16], T, U>(x: T, y: T) -> U
 2:52.15    |                                             ^^^^^^^^^
 2:52.15    |
 2:52.15    = note: the only supported types are integers, `bool` and `char`
 2:52.15    = help: more complex types are supported with `#![feature(adt_const_params)]`
 2:52.15 error: `[u32; 32]` is forbidden as the type of a const generic parameter
 2:52.15   --> /build/firefox/src/firefox-93.0/third_party/rust/packed_simd/src/codegen/llvm.rs:60:45
 2:52.15    |
 2:52.15 60 | pub unsafe fn __shuffle_vector32<const IDX: [u32; 32], T, U>(x: T, y: T) -> U
 2:52.15    |                                             ^^^^^^^^^
 2:52.15    |
 2:52.15    = note: the only supported types are integers, `bool` and `char`
 2:52.15    = help: more complex types are supported with `#![feature(adt_const_params)]`
 2:52.15 error: `[u32; 64]` is forbidden as the type of a const generic parameter
 2:52.15   --> /build/firefox/src/firefox-93.0/third_party/rust/packed_simd/src/codegen/llvm.rs:70:45
 2:52.15    |
 2:52.15 70 | pub unsafe fn __shuffle_vector64<const IDX: [u32; 64], T, U>(x: T, y: T) -> U
 2:52.15    |                                             ^^^^^^^^^
 2:52.15    |
 2:52.15    = note: the only supported types are integers, `bool` and `char`
 2:52.15    = help: more complex types are supported with `#![feature(adt_const_params)]`
 2:52.35    Compiling num_cpus v1.13.0
 2:53.13    Compiling fluent-langneg v0.13.0
 2:53.15    Compiling intl_pluralrules v7.0.1
 2:53.59    Compiling intl-memoizer v0.5.1
 2:55.32    Compiling gl_generator v0.14.0
 2:55.37    Compiling cose-c v0.1.5
 2:55.96    Compiling time v0.1.43
 2:56.01    Compiling iovec v0.1.4
 2:56.05    Compiling atty v0.2.14
 2:56.21 For more information about this error, try `rustc --explain E0557`.
 2:56.23    Compiling net2 v0.2.37
 2:56.24 The following warnings were emitted during compilation:
 2:56.25 warning: Cannot set `RUSTC_BOOTSTRAP=1` from build script of `packed_simd v0.3.4 (https://github.com/hsivonen/packed_simd?rev=6a16f954950401b92b4e220fbf2dfaf6f00e1fb2#6a16f954)`.
 2:56.25 note: Crates cannot set `RUSTC_BOOTSTRAP` themselves, as doing so would subvert the stability guarantees of Rust for your project.
 2:56.25 error: could not compile `packed_simd` due to 13 previous errors
 2:56.25 warning: build failed, waiting for other jobs to finish...
 3:17.66 error: build failed
 213 PackagesBug ReportMediumLow [libffi] libffi.so7/libffi.so.8 major ABI bump Closed
100%
Task Description

make and guile made it half (and broken) to stable.
breaking the cycle required a shim package libffi33 in build-support.
packages depending of libffi are rescheduled and need to be rebuilt first, pushing libffi.so.8 to stable now would make
‘make/guile’ work again, but break a lot of other stuff!

 212 PackagesBug ReportVery LowHigh libblockdev issue with glibc Closed
100%
Task Description

Trying to start udisks2 daemon (systemctl start udisks2.service) fails because of a library issue.

/usr/lib/udisks2/udisksd: symbol lookup error: /usr/lib/libbd_utils.so.2: undefined symbol: g_spawn_check_wait_status

Maybe libblockdev needs to be recompiled with the right glibc version.

Thus, it is not possible to auto-mount external USB drives.

 211 PackagesBug ReportVery LowMedium asp32 Closed
100%
Task Description

asp32 fails to export/checkout anything.

Esample:

# asp32 export pacman
fatal: unable to update url base from redirection:

asked for: https://git.archlinux.org/svntogit/packages.git/info/refs?service=git-upload-pack
 redirect: https://gitlab.archlinux.org/explore/groups

error: failed to update remote packages64

210PackagesBug ReportVery LowMediumkeymap don't gets fixed on login as set in /etc/vconsol...Unconfirmed
0%
Task Description

gzip comes with asm code, if enabled, built a TEXTREL which gets bloqued on boot, so systemd don’t set keymap
A lot of tricks in forums, old thread more complete here $506 An old problem. Work around while asm gets fixed is call configure with DEFS=”NO_ASM” like this:

...
export DEFS="NO_ASM"
./configure ....

or,

./configure DEFS="NO_ASM" ....

I have not tested it, but gentoo on x32 have gzip like this and no TEXTRELS here.
No matter i486, i686 or pentium.

Hope it helps.

Best regards.

209PackagesBug ReportVery LowLowIntel High Definition Audio issue.Unconfirmed
0%
Task Description

I am using Arch Linux 32 latest version on Sony VAIO VGN-FS215Z . The following is the audio device:

-fs215z:~$ lspci | grep -i audio

00:1b.0 Audio device: Intel Corporation 82801FB/FBM/FR/FW/FRW (ICH6 Family) High Definition Audio Controller (rev 03)

When I boot the system after some time getting crackling sound in speaker. Sometimes it stops after few minutes and sometimes continue to sound. Really annoying. I am not getting the normal audio in any application. This problem was there in debian based OSs also but not there in any other OS.

Please help.

 206 PackagesBug ReportVery LowLow SPAM Closed
100%
Task Description

no task description

 205 PackagesBug ReportVery LowLow SPAM Closed
100%
Task Description

no task description

 204 PackagesBug ReportMediumLow gdbm 1.21 fails in test 31 (convert new database format ...Closed
100%
Task Description

The bug report has been sent upstream to GDBM directly. This is too important to just ignore the failure.. (make check || true)

 203 PackagesBug ReportVery LowLow SPAM Closed
100%
Task Description

SPAM

 202 PackagesBug ReportVery LowLow SPAM Closed
100%
Task Description

SPAM

 201 PackagesBug ReportVery LowLow SPAM Closed
100%
Task Description

SPAM

 200 PackagesBug ReportVery LowLow SPAM Closed
100%
Task Description

SPAM

 199 PackagesBug ReportVery LowLow SPAM Closed
100%
Task Description

SPAM

Showing tasks 101 - 150 of 350 Page 3 of 7 - 1 - 2 - 3 - 4 - 5 - Last >>

Available keyboard shortcuts

Tasklist

Task Details

Task Editing