Bugs in Archlinux32 packages, specific to 32-bit issues.

Bugs  FS#2  to  FS#92  have been recovered and may be incomplete, the
recovered Google/Bing cache data can be found here.

IDCategoryTask TypePrioritySeveritySummary  ascStatusProgress
164PackagesBug ReportMediumLowpam_systemd.so hangs openssh 2 out of 3 timesNew
0%
Task Description

Effect: you can not log in.
The SSHd child runs on 100% CPU doing something.
This happens on i486, i686 and pentium4 equally.

180Packages: StableBug ReportVery LowLowPandoc requires specific-version haskell dependenciesNew
0%
Task Description
# pandoc --version
pandoc: error while loading shared libraries: libHSzip-archive-0.4.1-4yLWnBS0zifKkvfHVbmUo1-ghc8.10.2.so: cannot open shared object file: No such file or directory
<code>

Versions:
<code>
# pacman -Q | grep haskell
haskell-aeson 1.5.4.1-19.0
haskell-aeson-pretty 0.8.8-94.0
haskell-ansi-terminal 0.11-17.0
haskell-asn1-encoding 0.9.6-58.0
haskell-asn1-parse 0.9.5-58.0
haskell-asn1-types 0.3.4-37.0
haskell-assoc 1.0.2-27.0
haskell-async 2.2.2-40.0
haskell-attoparsec 0.13.2.4-36.0
haskell-base-compat 0.11.2-4.2
haskell-base-compat-batteries 0.11.2-11.0
haskell-base-orphans 0.8.3-14.0
haskell-base16-bytestring 0.1.1.7-3.0
haskell-base64-bytestring 1.2.0.1-3.0
haskell-basement 0.0.11-10.1
haskell-bifunctors 5.5.8-13.0
haskell-blaze-builder 0.4.2.1-2.1
haskell-blaze-html 0.9.1.2-57.0
haskell-blaze-markup 0.8.2.7-41.0
haskell-byteable 0.1.1-22.1
haskell-case-insensitive 1.2.1.0-39.0
haskell-cereal 0.5.8.1-9.0
haskell-citeproc 0.3.0.9-9.0
haskell-cmdargs 0.10.21-1.0
haskell-colour 2.3.5-75.0
haskell-commonmark 0.1.1.2-2.0
haskell-commonmark-extensions 0.2.0.3-1.0
haskell-commonmark-pandoc 0.2.0.1-24.0
haskell-comonad 5.0.6-58.0
haskell-conduit 1.3.4-3.0
haskell-conduit-extra 1.3.5-70.0
haskell-connection 0.3.1-99.0
haskell-cookie 0.4.5-9.1
haskell-cryptonite 0.27-32.0
haskell-data-default 0.7.1.1-87.0
haskell-data-default-class 0.1.2.0-21.1
haskell-data-default-instances-containers 0.0.1-33.1
haskell-data-default-instances-dlist 0.0.1-100.0
haskell-data-default-instances-old-locale 0.0.1-33.1
haskell-data-fix 0.3.0-35.0
haskell-digest 0.0.1.2-22.1
haskell-distributive 0.6.2-40.0
haskell-dlist 1.0-23.0
haskell-doclayout 0.3-45.0
haskell-doctemplates 0.9-40.0
haskell-emojis 0.1-47.0
haskell-erf 2.0.0.0-21.0
haskell-errors 2.3.0-59.1
haskell-file-embed 0.0.13.0-3.1
haskell-glob 0.10.1-28.0
haskell-haddock-library 1.9.0-58.0
haskell-hashable 1.3.0.0-36.0
haskell-hourglass 0.2.12-82.0
haskell-hslua 1.3.0-2.0
haskell-hslua-module-system 0.2.2.1-17.0
haskell-hslua-module-text 0.3.0.1-5.0
haskell-hsyaml 0.2.1.0-52.0
haskell-http 4000.3.15-49.0
haskell-http-client 0.7.6-14.0
haskell-http-client-tls 0.3.5.3-359.0
haskell-http-types 0.12.3-100.0
haskell-hxt 9.3.1.18-196.0
haskell-hxt-charproperties 9.5.0.0-1.0
haskell-hxt-regex-xmlschema 9.2.0.7-2.0
haskell-hxt-unicode 9.0.2.4-22.0
haskell-indexed-traversable 0.1.1-3.1
haskell-integer-logarithms 1.0.3.1-3.1
haskell-ipynb 0.1.0.1-192.0
haskell-jira-wiki-markup 1.3.2-27.0
haskell-juicypixels 3.3.5-37.0
haskell-memory 0.15.0-49.0
haskell-mime-types 0.1.0.9-11.1
haskell-mono-traversable 1.0.15.1-74.0
haskell-network 3.1.2.1-1.0
haskell-network-uri 2.6.3.0-217.0
haskell-old-locale 1.0.0.7-27.1
haskell-old-time 1.1.0.3-27.1
haskell-pandoc-types 1.22-13.0
haskell-pem 0.2.4-114.0
haskell-primitive 0.7.1.0-29.0
haskell-quickcheck 2.14.2-11.0
haskell-random 1.2.0-54.0
haskell-resourcet 1.2.4.2-31.0
haskell-safe 0.3.19-5.1
haskell-scientific 0.3.6.2-53.0
haskell-sha 1.6.4.4-16.1
haskell-skylighting 0.10.2-24.0
haskell-skylighting-core 0.10.2-24.0
haskell-socks 0.6.1-90.0
haskell-split 0.2.3.4-88.0
haskell-splitmix 0.1.0.3-5.0
haskell-streaming-commons 0.2.2.1-28.1
haskell-strict 0.4.0.1-1.0
haskell-syb 0.7.1-8.0
haskell-tagged 0.8.6.1-2.2
haskell-tagsoup 0.14.8-75.0
haskell-temporary 1.3-130.0
haskell-texmath 0.12.0.3-40.0
haskell-text-conversions 0.3.1-62.0
haskell-text-icu 0.7.0.1-37.1
haskell-th-abstraction 0.4.2.0-2.2
haskell-th-compat 0.1-12.0
haskell-these 1.1.1.1-28.0
haskell-time-compat 1.9.5-1.0
haskell-tls 1.5.5-3.0
haskell-transformers-compat 0.6.6-3.1
haskell-typed-process 0.2.6.0-63.0
haskell-unicode-transforms 0.3.7.1-42.0
haskell-uniplate 1.6.13-4.0
haskell-unliftio-core 0.2.0.1-6.1
haskell-unordered-containers 0.2.13.0-11.0
haskell-utf8-string 1.0.1.1-20.0
haskell-uuid-types 1.0.3-58.0
haskell-vector 0.12.1.2-64.0
haskell-vector-algorithms 0.8.0.4-1.0
haskell-x509 1.7.5-137.0
haskell-x509-store 1.6.7-136.0
haskell-x509-system 1.6.6-204.0
haskell-x509-validation 1.6.11-136.0
haskell-xml 1.3.14-27.2
haskell-xml-conduit 1.9.0.0-77.0
haskell-xml-types 0.3.8-5.1
haskell-zip-archive 0.4.1-66.0
haskell-zlib 0.6.2.2-4.0
28Packages: Build-listBug ReportMediumLowpostgrest: checks start a Postgresql server and then te...New
0%
Task Description

Starting check()… WARNING [pifpaf.drivers] `psutil.Popen(pid=2683, status=’terminated’)` is already gone, sending SIGKILL to its process group
WARNING [pifpaf.drivers] `psutil.Popen(pid=2671, status=’terminated’)` is already gone, sending SIGKILL to its process group
WARNING [pifpaf.drivers] `psutil.Popen(pid=2669, status=’terminated’)` is already gone, sending SIGKILL to its process group
ERROR [pifpaf] Error while running command: [b’/usr/bin/pg_ctl’, ‘-w’, ‘-o’, ‘-k /tmp/tmp5_5e9_hy -p 5432 -h “127.0.0.1”‘, ‘start’]
createdb: could not connect to database template1: could not connect to server: No such file or directory
Is the server running locally and accepting
connections on Unix domain socket “/run/postgresql/.s.PGSQL.5432”? ERROR: A failure occurred in check().
Aborting…
ERROR: Build failed, check /data/archbuild/staging-i686/arch32/build

Disabling tests for now.

  Comments (1)
  Related Tasks (0/0)

Admin
Andreas Baumann commented on 15.02.2018 16:56

Didn’t pifpaf itself had problems building? Maybe it’s a pifpaf issue..

Bing cache

116PackagesBug ReportMediumLowRace causes iptables not to be ready after startupNew
0%
Task Description

Nov 06 08:04:01 eurohp1 systemd[1]: Starting IPv4 Packet Filtering Framework… Nov 06 08:04:01 eurohp1 iptables-restore[287]: Another app is currently holding the xtables lock. Perhap>
Nov 06 08:04:01 eurohp1 systemd[1]: iptables.service: Main process exited, code=exited, status=4/NOPERMI>
Nov 06 08:04:01 eurohp1 systemd[1]: iptables.service: Failed with result ‘exit-code’.
Nov 06 08:04:01 eurohp1 systemd[1]: Failed to start IPv4 Packet Filtering Framework.

Works when starting iptables later manually.

This is security relevant as not having a firewall after startup puts the system at risk.

166PackagesBug ReportMediumLows2n-tls: failing testsNew
0%
Task Description

The following tests FAILED:

       91 - s2n_pq_kem_hybrid_kat_test (Failed)
      145 - s2n_session_ticket_test (Failed)
      154 - s2n_stuffer_network_order_test (Failed)
      184 - s2n_x509_validator_test (Failed)

https://github.com/aws/s2n-tls/issues/2405 https://github.com/aws/s2n-tls/issues/2406 https://github.com/aws/s2n-tls/issues/2404

3 are known upstream too.

163PackagesBug ReportMediumLowsphinx_rtd_theme is used to build documentation but doe...New
0%
Task Description
build
running build_py
npm WARN npm npm does not support Node.js v15.9.0
npm WARN npm You should probably upgrade to a newer version of node as we
npm WARN npm can't make any promises that npm will work with this version.
npm WARN npm Supported releases of Node.js are the latest release of 6, 8, 9, 10, 11, 12, 13.
npm WARN npm You can find the latest version at https://nodejs.org/

> sphinx_rtd_theme@0.5.1 preinstall /build/python-sphinx_rtd_theme/src/sphinx_rtd_theme-0.5.1
> bin/preinstall.js

Traceback (most recent call last):
  File "/build/python-sphinx_rtd_theme/src/sphinx_rtd_theme-0.5.1/setup.py", line 86, in <module>
    setup(
  File "/usr/lib/python3.9/site-packages/setuptools/__init__.py", line 153, in setup
    return distutils.core.setup(**attrs)
  File "/usr/lib/python3.9/distutils/core.py", line 148, in setup
    dist.run_commands()
  File "/usr/lib/python3.9/distutils/dist.py", line 966, in run_commands
    self.run_command(cmd)
  File "/usr/lib/python3.9/distutils/dist.py", line 985, in run_command
    cmd_obj.run()
  File "/usr/lib/python3.9/distutils/command/build.py", line 135, in run
    self.run_command(cmd_name)
  File "/usr/lib/python3.9/distutils/cmd.py", line 313, in run_command
    self.distribution.run_command(command)
  File "/usr/lib/python3.9/distutils/dist.py", line 985, in run_command
    cmd_obj.run()
  File "/build/python-sphinx_rtd_theme/src/sphinx_rtd_theme-0.5.1/setup.py", line 22, in run
    subprocess.run(['npm', 'install'], check=True)
  File "/usr/lib/python3.9/subprocess.py", line 524, in run
    raise CalledProcessError(retcode, process.args,
subprocess.CalledProcessError: Command '['npm', 'install']' died with <Signals.SIGSEGV: 11>.
==> ERROR: A failure occurred in build().
    Aborting...
==> ERROR: Build failed, check /var/lib/archbuild/staging-pentium4/abaumann/build
36Packages: TestingBug ReportMediumLowtexlive-core: SSE2 requiredNew
0%
Task Description

Attached to Project: Archlinux32
Opened by Andreas Baumann - 14.04.2018
Last edited by Andreas Baumann - 16.04.2018
FS#36 - texlive-core: SSE2 required

(4/5) Updating TeXLive format files… PANIC: unprotected error in call to Lua API (CPU with SSE2 required)
fmtutil [ERROR]: running `luajittex -ini -jobname=luajittex -progname=luajittex luatex.ini /null’ return status 1
fmtutil [ERROR]: return error due to options –strict
error: command failed to execute correctly
(5/5) Updating TeXLive font maps…

So, the problem seems to be in lua itself?

Bing Cache

143PackagesBug ReportMediumLowthunderbird doesn't build and runNew
0%
Task Description

still linked against icu67.

Same here, I cannot believe that somebody is actually using thunderbird on Archlinux32 anymore.

Triggered rebuild, doesn’t build currently.

196PackagesBug ReportMediumLowupdate filesystemNew
0%
Task Description

b3da2fc1c25065a1bd09f9930eeed1d11dc312e4 only updated half the package - we’re missing:

- update the logo
- update the url (?)
- only if both are done: updating the hash on top of the PKGBUILD

117PackagesBug ReportVery LowLowvboxdrive module missingNew
0%
Task Description

vboxdrv module is missing making virtualbox unusable.

I’m currently running kernel 5.9.0-1.0-pae but it doesn’t seem to be there in any version

103Packages: StableBug ReportMediumLowyarn segfaultsNew
0%
Task Description

experienced when building buildbot-www

/bin/sh: line 1: 4744 Segmentation fault (core dumped) yarn install –pure-lockfile

Showing tasks 51 - 61 of 61 Page 2 of 2 - 1 - 2

Available keyboard shortcuts

Tasklist

Task Details

Task Editing