Bugs in Archlinux32 packages, specific to 32-bit issues.

Bugs  FS#2  to  FS#92  have been recovered and may be incomplete, the
recovered Google/Bing cache data can be found here.

IDCategoryTask TypePrioritySeverity  descSummaryStatusProgress
276PackagesBug ReportMediumLowLTO optimization needs to much memoryNew
0%
Task Description

7234 build 20 0 1353768 1.2g 18020 R 96.1 64.0 4:27.92 lto1-wpa

xf86-video-intel (this is not exactly a huge package, but maybe the
included X libraries are?)

We lost it on i486 already (because it doesn’t work with newer gcc, or at least
I didn’t investigate how to make it work).

I suggest to get rid of LTO completely.
The problem is patching all the options=(lto), –enable-lto/ –without-lto -D b_lto=tru
etc. which easily creates a maintainance nightmare.

Maybe an easier way to go is to have them similar to the ‘lib32-’ stripping
in the main build scripts or hooks? Downstream this might create
trouble tough, as the build systems are different..

Upstream has options=(lto) support, but it doesn’t seen helping here as packages
need local flags everywhere..

126PackagesBug ReportMediumLowlua hooks break in TeX on i686New
0%
Task Description
PANIC: unprotected error in call to Lua API (CPU with SSE2 required)
PANIC: unprotected error in call to Lua API (CPU with SSE2 required)
fmtutil [ERROR]: running `luajittex -ini   -jobname=luajittex -progname=luajittex luatex.ini </dev/null' return status: 1
fmtutil [ERROR]: cannot copy log luajittex.log to: /var/lib/texmf/web2c/luajittex
fmtutil [ERROR]: returning error due to option --strict
fmtutil [ERROR]: running `luajithbtex -ini   -jobname=luajithbtex -progname=luajithbtex luatex.ini </dev/null' return status: 1
fmtutil [ERROR]: cannot copy log luajithbtex.log to: /var/lib/texmf/web2c/luajithbtex
fmtutil [ERROR]: returning error due to option --strict
error: command failed to execute correctly
141DevopsBug ReportMediumLowmake iso build more reliablyNew
0%
Task Description

Currently, the iso build are several bash scripts on several machines requiring to move stuff via sshfs and alike.

This should become more stable - ideally some single script/package/systemd-unit with proper error reporting (email or irc come to my mind)

347PackagesBug ReportVery LowLowMeld will not start - error message -> Meld requires Gt...Unconfirmed
0%
Task Description

[keith@Arch32 ~]$ meld
Meld requires Gtk+ 3.20 or higher.
[keith@Arch32 ~]$ pacman -Qi meld
Name : meld
Version : 3.22.0-2.0
Description : Compare files, directories and working copies
Architecture : any
URL : https://meldmerge.org/ Licenses : GPL Groups : None
Provides : None
Depends On : python-gobject python-cairo gtksourceview4 gsettings-desktop-schemas dconf
Optional Deps : None
Required By : None
Optional For : None
Conflicts With : None
Replaces : None
Installed Size : 5.06 MiB
Packager : TasosSah arch32@tasossah.com Build Date : Sat 19 Aug 2023 23:25:57 BST
Install Date : Sat 26 Aug 2023 07:08:59 BST
Install Reason : Explicitly installed
Install Script : No
Validated By : Signature

[keith@Arch32 ~]$ pacman -Qi gtksourceview4
Name : gtksourceview4
Version : 4.8.4-1.0
Description : A text widget adding syntax highlighting and more to GNOME
Architecture : pentium4
URL : https://wiki.gnome.org/Projects/GtkSourceView Licenses : GPL Groups : None
Provides : libgtksourceview-4.so=0-32
Depends On : gtk3 libxml2
Optional Deps : None
Required By : meld xed
Optional For : None
Conflicts With : None
Replaces : None
Installed Size : 7.44 MiB
Packager : Andreas Baumann mail@andreasbaumann.cc Build Date : Mon 07 Nov 2022 11:50:56 GMT
Install Date : Mon 28 Nov 2022 11:49:04 GMT
Install Reason : Installed as a dependency for another package
Install Script : No
Validated By : Signature

[keith@Arch32 ~]$ pacman -Qi gtk3
Name : gtk3
Version : 1:3.24.37-1.0
Description : GObject-based multi-platform GUI toolkit
Architecture : pentium4
URL : https://www.gtk.org/ Licenses : LGPL Groups : None
Provides : gtk3-print-backends libgailutil-3.so=0-32 libgdk-3.so=0-32 libgtk-3.so=0-32
Depends On : adwaita-icon-theme atk cairo cantarell-fonts dconf desktop-file-utils fontconfig fribidi gdk-pixbuf2 glib2 harfbuzz iso-codes

                libcloudproviders  libcolord  libcups  libegl  libepoxy  libgl  librsvg  libxcomposite  libx11  libxcursor  libxdamage  libxext  libxfixes
                libxi  libxinerama  libxkbcommon  libxrandr  libxrender  pango  shared-mime-info  wayland  at-spi2-core  tracker3  gtk-update-icon-cache

Optional Deps : evince: Default print preview command
Required By : bleachbit engrampa firefox gcr gpicview gspell gtkmm3 gtksourceview4 libdbusmenu-gtk3 libgnomekbd libindicator-gtk3 libnma

                libpeas  lightdm-gtk-greeter  lxmusic  vte3  xdg-user-dirs-gtk

Optional For : avahi gvfs libcanberra libdecor libreoffice-still
Conflicts With : gtk3-print-backends
Replaces : gtk3-print-backends⇐3.22.26-1
Installed Size : 49.88 MiB
Packager : Andreas Baumann mail@andreasbaumann.cc Build Date : Sun 16 Apr 2023 11:18:09 BST
Install Date : Tue 25 Apr 2023 13:06:04 BST
Install Reason : Installed as a dependency for another package
Install Script : Yes
Validated By : Signature

[keith@Arch32 ~]$

100Packages: StableBug ReportVery LowLowmldonkey crashesUnconfirmed
0%
Task Description

All versions of mldonkey crash in arch32 updated. (segmentation fault and core dumped)

314PackagesBug ReportVery LowLowMumble requires a outdated protobuf Unconfirmed
0%
Task Description

libprotobuf=28 is a mumble (package) dependency, but protobuf package has libprotobuf=32.

I needed to downgrade to protobuf-3.17.3-1.3-pentium4.pkg.tar.zst (from the archive) to install mumble.

63Packages: StableBug ReportMediumLownodejs crashes in libuv when cleaning up FSReqCallbackNew
0%
Task Description

Attached to Project: Archlinux32
Opened by Andreas Baumann - 07.02.2019
FS#63 - nodejs crashes in libuv when cleaning up FSReqCallback

Program terminated with signal SIGSEGV, Segmentation fault.
#0 0×00945919 in node::fs::FSReqCallback::~FSReqCallback() ()
[Current thread is 1 (Thread 0xb5614880 (LWP 2013))]
(gdb) bt
#0 0×00945919 in node::fs::FSReqCallback::~FSReqCallback() ()
#1 0×00937274 in node::fs::FSReqAfterScope::~FSReqAfterScope() ()
#2 0x0093767d in node::fs::AfterInteger(uv_fs_s*) ()
#3 0xb7e910e0 in uv.work_done () from /usr/lib/libuv.so.1
#4 0xb7e9526e in ?? () from /usr/lib/libuv.so.1
#5 0xb7ea51f8 in uv.io_poll () from /usr/lib/libuv.so.1
#6 0xb7e95c51 in uv_run () from /usr/lib/libuv.so.1
#7 0x00905d37 in node::Start(v8::Isolate*, node::IsolateData*, std::vector, std::allocator &gt;, std::allocator, std::allocator &gt; &gt; &gt; const&amp;, std::vector, std::allocator &gt;, std::allocator, std::allocator &gt; &gt; &gt; const&amp;) ()
#8 0×00903655 in node::Start(int, char**) ()
#9 0x008acef1 in main ()

This affects gyp, vault and probably some other packages, depending whether those callbacks are used or not.

  Comments (1)
  Related Tasks (0/0)

Admin
Andreas Baumann commented on 07.02.2019 09:36

See also mailing list thread:

https://lists.archlinux.org/pipermail/arch-ports/2018-November/000835.html

Google Code

132PackagesBug ReportMediumLowOLPC-XO-1 kernel, usb8xx module crashingNew
0%
Task Description
[   21.686772] usb8xxx: Firmware ready event received
[   21.717061] usb8xxx 1-1:1.0 (unnamed net_device) (uninitialized): 00:17:c4:10:e3:67, fw 5.110.22p23, cap 0x000003a3
[   21.897489] usb8xxx 1-1:1.0 wlan0: Marvell WLAN 802.11 adapter
[   22.004871] usb8xxx 1-1:1.0 wlan0: PREP_CMD: command 0x0074 failed: 2
[   22.109002] usb8xxx 1-1:1.0 wlan0: Firmware does not seem to support PS mode
[   22.217405] usb8xxx 1-1:1.0 wlan0: PREP_CMD: command 0x0043 failed: 1
[   22.318862] usb8xxx 1-1:1.0 wlan0: HOST_SLEEP_CFG failed 1
[   23.468484] usb8xxx 1-1:1.0 wlp0s15f5u1: renamed from msh0
[   43.523176] ------------[ cut here ]------------
[   43.556197] WARNING: CPU: 0 PID: 148 at net/wireless/core.c:1346 cfg80211_netdev_notifier_call+0x102/0x31e
[   43.625361] Modules linked in: input_leds led_class usb8xxx libertas serio_raw
[   43.664224] CPU: 0 PID: 148 Comm: wpa_supplicant Not tainted 5.10.5-arch1-1.0-olpc-xo1 #1
[   43.715531] Hardware name: OLPC XO/XO, BIOS OLPC Ver 1.00.01 06/11/2014
[   43.754829] EIP: cfg80211_netdev_notifier_call+0x102/0x31e
[   43.792862] Code: ff 89 f0 e8 4d fc ff ff 8b 46 7c 85 c0 74 2a 39 58 34 75 25 80 78 64 00 75 16 8b 96 80 00 00 00 85 d2 74 06 80 7a 64 00 75 06 <0f> 0b c6 40 62 01 31 d2 89 f0 e8 3d 7a 00 00 8b 86 88 00 00 00 8b
[   43.911511] EAX: c36e1d00 EBX: c2cb8800 ECX: ffffffff EDX: 00000000
[   43.958939] ESI: c341c000 EDI: c1f7d000 EBP: c1eebdd4 ESP: c1eebdbc
[   44.002464] DS: 007b ES: 007b FS: 0000 GS: 00e0 SS: 0068 EFLAGS: 00010246
[   44.045454] CR0: 80050033 CR2: b69e5428 CR3: 01ff0000 CR4: 00000090
[   44.088019] Call Trace:
[   44.126010]  ? fib_disable_ip+0x2a/0x2d
[   44.165297]  ? cfg80211_register_wdev+0x46/0x46
[   44.208941]  notifier_call_chain+0x2a/0x4e
[   44.252482]  raw_notifier_call_chain+0xc/0xe
[   44.296501]  call_netdevice_notifiers_info+0x5d/0x64
[   44.338599]  call_netdevice_notifiers+0x18/0x1a
[   44.379580]  __dev_notify_flags+0x4a/0x7c
[   44.419064]  dev_change_flags+0x3d/0x46
[   44.464304]  devinet_ioctl+0x260/0x4cd
[   44.502437]  inet_ioctl+0x139/0x163
[   44.539766]  ? dev_name_hash+0x20/0x36
[   44.577060]  ? dev_get_by_name_rcu+0x1c/0x2f
[   44.614874]  ? dev_ioctl+0x2e4/0x40e
[   44.651928]  ? inet_recvmsg+0x77/0x77
[   44.692778]  sock_ioctl+0x2ad/0x36f
[   44.730157]  ? preempt_count_add+0x4a/0x4f
[   44.771397]  ? ____sys_recvmsg+0xbc/0xbc
[   44.808485]  vfs_ioctl+0x1a/0x24
[   44.847256]  __ia32_sys_ioctl+0x5aa/0x5c4
[   44.891962]  ? debug_smp_processor_id+0x12/0x14
[   44.930996]  ? fpregs_assert_state_consistent+0x17/0x34
[   44.967562]  ? exit_to_user_mode_prepare+0x84/0x94
[   45.002448]  do_int80_syscall_32+0x2c/0x39
[   45.035656]  entry_INT80_32+0xf3/0xf3
[   45.067762] EIP: 0xb790ffc4
[   45.097915] Code: 83 c4 0c 89 d8 5b 5e 5f 5d c3 66 90 66 90 66 90 66 90 66 90 66 90 53 8b 54 24 10 8b 4c 24 0c 8b 5c 24 08 b8 36 00 00 00 cd 80 <5b> 3d 01 f0 ff ff 0f 83 a0 3f f3 ff c3 66 90 66 90 66 90 66 90 66
[   45.199342] EAX: ffffffda EBX: 00000007 ECX: 00008914 EDX: bffe736c
[   45.233187] ESI: bffe736c EDI: 0076c850 EBP: 00000000 ESP: bffe7348
[   45.266705] DS: 007b ES: 007b FS: 0000 GS: 0033 SS: 007b EFLAGS: 00000296
[   45.300799] ---[ end trace 20811b76aa348f84 ]---
[   64.909322] IPv6: ADDRCONF(NETDEV_CHANGE): wlp0s15f5u1: link becomes ready

Warm reboot a second time seems to help.

348PackagesBug ReportMediumLowopenssl failing testsNew
0%
Task Description
30-test_aesgcm.t ........................ ok                                                                ������������������������������������������������������������������                                                                                             

ALG_PERR: engines/e_afalg.c(463): Failed to bind socket : No such file or directory                         �����������������������������������������������������������������������������������������������������������������������������                                                                                   
        # ERROR: (bool) 'EVP_CipherInit_ex(ctx, cipher, e, key, iv, 1) == true' failed @ test/afalgtest.c   ������������������������������������������������������������������������������������������������������������������������������������������������������������c                                                                             :85                                                                                                         �����           
        # false                                                                                             �����������������������                                                        
        # 00000000:error:40000067:lib(128)::socket bind failed:engines/e_afalg.c:464:                       ������������������������������������������������������������������������������������������������������������������������������:                                                                                  
        # OPENSSL_TEST_RAND_SEED=1707239178                                                                 �����������������������������������������������������������������                                                                                             
        not ok 1 - iteration 1                                                                              ������������������������������������������ㄠ                                                                                                
# ------------------------------------------------------------------------------                            ������������������������������������������������������������������������������������������������������������������������                                                                                    
ALG_PERR: engines/e_afalg.c(463): Failed to bind socket : No such file or directory                         �����������������������������������������������������������������������������������������������������������������������������                                                                                   
        # ERROR: (bool) 'EVP_CipherInit_ex(ctx, cipher, e, key, iv, 1) == true' failed @ test/afalgtest.c   ������������������������������������������������������������������������������������������������������������������������������������������������������������c                                                                             :85                                                                                                         �����           
        # false                                                                                             �����������������������                                                        
        # 00000000:error:40000067:lib(128)::socket bind failed:engines/e_afalg.c:464:                       ������������������������������������������������������������������������������������������������������������������������������:                                                                                  
        # OPENSSL_TEST_RAND_SEED=1707239178                                                                 �����������������������������������������������������������������                                                                                             
        not ok 2 - iteration 2                                                                              ������������������������������������������㈠                                                                                                
# ------------------------------------------------------------------------------                            ������������������������������������������������������������������������������������������������������������������������                                                                                    
ALG_PERR: engines/e_afalg.c(463): Failed to bind socket : No such file or directory                         �����������������������������������������������������������������������������������������������������������������������������                                                                                   
        # ERROR: (bool) 'EVP_CipherInit_ex(ctx, cipher, e, key, iv, 1) == true' failed @ test/afalgtest.c   ������������������������������������������������������������������������������������������������������������������������������������������������������������c                                                                             :85                                                                                                         �����           
        # false                                                                                             �����������������������                                                        
        # 00000000:error:40000067:lib(128)::socket bind failed:engines/e_afalg.c:464:                       ������������������������������������������������������������������������������������������������������������������������������:                                                                                  
        # OPENSSL_TEST_RAND_SEED=1707239178                                                                 �����������������������������������������������������������������                                                                                             
        not ok 3 - iteration 3                                                                              ������������������������������������������㌠                                                                                                
# ------------------------------------------------------------------------------                            ������������������������������������������������������������������������������������������������������������������������                                                                                    
    # OPENSSL_TEST_RAND_SEED=1707239178                                                                     �����������������������������������������������������������                                                                                              
    not ok 1 - test_afalg_aes_cbc                                                                           ������������������������������������������������c                                                                                               
# ------------------------------------------------------------------------------                            ������������������������������������������������������������������������������������������������������������������������                                                                                    
../../util/wrap.pl ../../test/afalgtest => 1                                                                ������������������������������������������������������������������                                                                                             
not ok 1 - running afalgtest                                                                                ������������������������������������������                                                                                                 

343PackagesBug ReportVery LowLowPackage 'screen 4.9.1-1.0' is missing dependency libute...Unconfirmed
0%
Task Description

Package ‘screen 4.9.1-1.0’ is missing dependency libutempter. I assume this is because libutempter used to be a dependency of util-linux which is part of base, so was assumed to be installed.

With the regular Arch Linux distro libutempter is still a dependency of util-linux.

337PackagesBug ReportMediumLowpackages are being downgraded in reposNew
0%
Task Description

warning: filesystem: local (2023.09.18-1.0) is newer than core (2023.01.31-1.0)

164PackagesBug ReportMediumLowpam_systemd.so hangs openssh 2 out of 3 timesNew
0%
Task Description

Effect: you can not log in.
The SSHd child runs on 100% CPU doing something.
This happens on i486, i686 and pentium4 equally.

346PackagesBug ReportVery LowLowpandoc: error while loading shared librariesUnconfirmed
0%
Task Description
# pacman -Syyuu base
# pacman -S pandoc
# pandoc
pandoc: error while loading shared libraries: libHSzip-archive-0.4.1-FOOm53qGfUr2AB1Oel9iH4-ghc8.10.2.so: cannot open shared object file: No such file or directory
28Packages: Build-listBug ReportMediumLowpostgrest: checks start a Postgresql server and then te...New
0%
Task Description

Starting check()… WARNING [pifpaf.drivers] `psutil.Popen(pid=2683, status=’terminated’)` is already gone, sending SIGKILL to its process group
WARNING [pifpaf.drivers] `psutil.Popen(pid=2671, status=’terminated’)` is already gone, sending SIGKILL to its process group
WARNING [pifpaf.drivers] `psutil.Popen(pid=2669, status=’terminated’)` is already gone, sending SIGKILL to its process group
ERROR [pifpaf] Error while running command: [b’/usr/bin/pg_ctl’, ‘-w’, ‘-o’, ‘-k /tmp/tmp5_5e9_hy -p 5432 -h “127.0.0.1”‘, ‘start’]
createdb: could not connect to database template1: could not connect to server: No such file or directory
Is the server running locally and accepting
connections on Unix domain socket “/run/postgresql/.s.PGSQL.5432”? ERROR: A failure occurred in check().
Aborting…
ERROR: Build failed, check /data/archbuild/staging-i686/arch32/build

Disabling tests for now.

  Comments (1)
  Related Tasks (0/0)

Admin
Andreas Baumann commented on 15.02.2018 16:56

Didn’t pifpaf itself had problems building? Maybe it’s a pifpaf issue..

Bing cache

359PackagesBug ReportVery LowLowQterminal 1.3.0-1.1 is brokenUnconfirmed
0%
Task Description

Qterminal 1.3.0-1.1 is broken. It causes a segmentation fault. Upgrade to 1.4.0-1.0 (still in staging) solves this issue.

116PackagesBug ReportMediumLowRace causes iptables not to be ready after startupNew
0%
Task Description

Nov 06 08:04:01 eurohp1 systemd[1]: Starting IPv4 Packet Filtering Framework… Nov 06 08:04:01 eurohp1 iptables-restore[287]: Another app is currently holding the xtables lock. Perhap>
Nov 06 08:04:01 eurohp1 systemd[1]: iptables.service: Main process exited, code=exited, status=4/NOPERMI>
Nov 06 08:04:01 eurohp1 systemd[1]: iptables.service: Failed with result ‘exit-code’.
Nov 06 08:04:01 eurohp1 systemd[1]: Failed to start IPv4 Packet Filtering Framework.

Works when starting iptables later manually.

This is security relevant as not having a firewall after startup puts the system at risk.

166PackagesBug ReportMediumLows2n-tls: failing testsNew
0%
Task Description

The following tests FAILED:

       91 - s2n_pq_kem_hybrid_kat_test (Failed)
      145 - s2n_session_ticket_test (Failed)
      154 - s2n_stuffer_network_order_test (Failed)
      184 - s2n_x509_validator_test (Failed)

https://github.com/aws/s2n-tls/issues/2405 https://github.com/aws/s2n-tls/issues/2406 https://github.com/aws/s2n-tls/issues/2404

3 are known upstream too.

163PackagesBug ReportMediumLowsphinx_rtd_theme is used to build documentation but doe...New
0%
Task Description
build
running build_py
npm WARN npm npm does not support Node.js v15.9.0
npm WARN npm You should probably upgrade to a newer version of node as we
npm WARN npm can't make any promises that npm will work with this version.
npm WARN npm Supported releases of Node.js are the latest release of 6, 8, 9, 10, 11, 12, 13.
npm WARN npm You can find the latest version at https://nodejs.org/

> sphinx_rtd_theme@0.5.1 preinstall /build/python-sphinx_rtd_theme/src/sphinx_rtd_theme-0.5.1
> bin/preinstall.js

Traceback (most recent call last):
  File "/build/python-sphinx_rtd_theme/src/sphinx_rtd_theme-0.5.1/setup.py", line 86, in <module>
    setup(
  File "/usr/lib/python3.9/site-packages/setuptools/__init__.py", line 153, in setup
    return distutils.core.setup(**attrs)
  File "/usr/lib/python3.9/distutils/core.py", line 148, in setup
    dist.run_commands()
  File "/usr/lib/python3.9/distutils/dist.py", line 966, in run_commands
    self.run_command(cmd)
  File "/usr/lib/python3.9/distutils/dist.py", line 985, in run_command
    cmd_obj.run()
  File "/usr/lib/python3.9/distutils/command/build.py", line 135, in run
    self.run_command(cmd_name)
  File "/usr/lib/python3.9/distutils/cmd.py", line 313, in run_command
    self.distribution.run_command(command)
  File "/usr/lib/python3.9/distutils/dist.py", line 985, in run_command
    cmd_obj.run()
  File "/build/python-sphinx_rtd_theme/src/sphinx_rtd_theme-0.5.1/setup.py", line 22, in run
    subprocess.run(['npm', 'install'], check=True)
  File "/usr/lib/python3.9/subprocess.py", line 524, in run
    raise CalledProcessError(retcode, process.args,
subprocess.CalledProcessError: Command '['npm', 'install']' died with <Signals.SIGSEGV: 11>.
==> ERROR: A failure occurred in build().
    Aborting...
==> ERROR: Build failed, check /var/lib/archbuild/staging-pentium4/abaumann/build
36Packages: TestingBug ReportMediumLowtexlive-core: SSE2 requiredNew
0%
Task Description

Attached to Project: Archlinux32
Opened by Andreas Baumann - 14.04.2018
Last edited by Andreas Baumann - 16.04.2018
FS#36 - texlive-core: SSE2 required

(4/5) Updating TeXLive format files… PANIC: unprotected error in call to Lua API (CPU with SSE2 required)
fmtutil [ERROR]: running `luajittex -ini -jobname=luajittex -progname=luajittex luatex.ini /null’ return status 1
fmtutil [ERROR]: return error due to options –strict
error: command failed to execute correctly
(5/5) Updating TeXLive font maps…

So, the problem seems to be in lua itself?

Bing Cache

143PackagesBug ReportMediumLowthunderbird doesn't build and runNew
0%
Task Description

still linked against icu67.

Same here, I cannot believe that somebody is actually using thunderbird on Archlinux32 anymore.

Triggered rebuild, doesn’t build currently.

349PackagesBug ReportMediumLowtop print "get_mempolicy: Function not implemented" on ...New
0%
Task Description

no task description

196PackagesBug ReportMediumLowupdate filesystemNew
0%
Task Description

b3da2fc1c25065a1bd09f9930eeed1d11dc312e4 only updated half the package - we’re missing:

- update the logo
- update the url (?)
- only if both are done: updating the hash on top of the PKGBUILD

117PackagesBug ReportVery LowLowvboxdrive module missingNew
0%
Task Description

vboxdrv module is missing making virtualbox unusable.

I’m currently running kernel 5.9.0-1.0-pae but it doesn’t seem to be there in any version

103Packages: StableBug ReportMediumLowyarn segfaultsNew
0%
Task Description

experienced when building buildbot-www

/bin/sh: line 1: 4744 Segmentation fault (core dumped) yarn install –pure-lockfile

342PackagesBug ReportVery LowVery Lownmap missing dependency openssl-1.1Unconfirmed
0%
Task Description

no task description

Showing tasks 51 - 75 of 75 Page 2 of 2 - 1 - 2

Available keyboard shortcuts

Tasklist

Task Details

Task Editing