Bugs in Archlinux32 packages, specific to 32-bit issues.

Bugs  FS#2  to  FS#92  have been recovered and may be incomplete, the
recovered Google/Bing cache data can be found here.

IDCategoryTask TypePrioritySeveritySummaryStatus  descProgress
243PackagesBug ReportVery LowMedium[linux and linux-zen] 5.16.12 needs a rebuild with gcc...New
0%
Task Description

[linux and linux-zen] 5.16.12 needs a rebuild with gcc 11.2 so DKMS packages will work

get errors when dkms installing in make log

cc1: error: incompatible gcc/plugin versions
cc1: error: failed to initialize plugin ./scripts/gcc-plugins/structleak_plugin.so

20Packages: Build-listBug ReportMediumLow[sagemath-doc] building documentation using Sphinx segf...New
0%
Task Description

[tutorial ] Saved pickle file: citations.pickle
[tutorial ] Exception occurred:
[tutorial ] File “/usr/lib/python2.7/site-packages/sphinx/environment/init.py”, line 152, in dump
[tutorial ] pickle.dump(env, f, pickle.HIGHEST_PROTOCOL)
[tutorial ] MemoryError
[tutorial ] The full traceback has been saved in /tmp/sphinx-err-kSNZ9A.log, if you want to report the issue to the developers.
[tutorial ] Please also report this if it was a user error, so that a better error message can be provided next time.
[tutorial ] A bug report can be filed in the tracker at . Thanks!
Build finished. The built documents can be found in /build/sagemath-doc/src/sage-8.1/src/doc/html/ja/tutorial
/startdir/PKGBUILD: line 79: 2540 Segmentation fault (core dumped) python2 sage_setup/docbuild –no-pdf-links -k all html
==> ERROR: A failure occurred in build().

  Aborting...

==> ERROR: Build failed, check /data/archbuild/staging-i686/copy/build

Bing Cache

28Packages: Build-listBug ReportMediumLowpostgrest: checks start a Postgresql server and then te...New
0%
Task Description

Starting check()… WARNING [pifpaf.drivers] `psutil.Popen(pid=2683, status=’terminated’)` is already gone, sending SIGKILL to its process group
WARNING [pifpaf.drivers] `psutil.Popen(pid=2671, status=’terminated’)` is already gone, sending SIGKILL to its process group
WARNING [pifpaf.drivers] `psutil.Popen(pid=2669, status=’terminated’)` is already gone, sending SIGKILL to its process group
ERROR [pifpaf] Error while running command: [b’/usr/bin/pg_ctl’, ‘-w’, ‘-o’, ‘-k /tmp/tmp5_5e9_hy -p 5432 -h “127.0.0.1”‘, ‘start’]
createdb: could not connect to database template1: could not connect to server: No such file or directory
Is the server running locally and accepting
connections on Unix domain socket “/run/postgresql/.s.PGSQL.5432”? ERROR: A failure occurred in check().
Aborting…
ERROR: Build failed, check /data/archbuild/staging-i686/arch32/build

Disabling tests for now.

  Comments (1)
  Related Tasks (0/0)

Admin
Andreas Baumann commented on 15.02.2018 16:56

Didn’t pifpaf itself had problems building? Maybe it’s a pifpaf issue..

Bing cache

36Packages: TestingBug ReportMediumLowtexlive-core: SSE2 requiredNew
0%
Task Description

Attached to Project: Archlinux32
Opened by Andreas Baumann - 14.04.2018
Last edited by Andreas Baumann - 16.04.2018
FS#36 - texlive-core: SSE2 required

(4/5) Updating TeXLive format files… PANIC: unprotected error in call to Lua API (CPU with SSE2 required)
fmtutil [ERROR]: running `luajittex -ini -jobname=luajittex -progname=luajittex luatex.ini /null’ return status 1
fmtutil [ERROR]: return error due to options –strict
error: command failed to execute correctly
(5/5) Updating TeXLive font maps…

So, the problem seems to be in lua itself?

Bing Cache

40Packages: StableBug ReportMediumLow[extra/gimp] is uninstallable because [extra/gegl02 ...New
0%
Task Description

20.06.2018 - [extra/gegl02] (which provided gegl=0.2; [extra/gegl] is 0.3) was removed, despite that it was still needed by [extra/gimp]. [extra/gimp] is an old …

54Packages: StableBug ReportMediumLow[pam] links against libaudit, but doesn't declare a dep...New
0%
Task Description

Attached to Project: Archlinux32
Opened by Luke Shumaker - 09.10.2018
FS#54 - [pam] links against libaudit, but doesn’t declare a dependency on [audit]

Both core/pam 1.3.1-1.2 and staging/pam 1.3.1-1.3 have their libpam.so link against libaudit:

$ readelf –dynamic /usr/lib/libpam.so.0.84.2

Dynamic section at offset 0xfdbc contains 27 entries:

Tag        Type                         Name/Value

0×00000001 (NEEDED) Shared library: [libaudit.so.1]

However, the package does not declare depends=(audit) (’audit’ is the package that contains libaudit.so).

This is normally a fairly invisible mistake because recent versions of systemd depend on audit, so systemd-users (i.e. most users) will have audit installed anyway.

This affects `su` (of util-linux) and `sudo` (of sudo), which both link against libpam.

  Comments (4)
  Related Tasks (0/0)

Admin
Erich Eckner commented on 09.10.2018 20:42

pam also links against libaudit.so.1 iff rebuilt for x86_64 - but not the currently built one for x86_64:

— /dev/fd/63 2018-10-09 22:41:57.015507993 +0200
+++ /dev/fd/62 2018-10-09 22:41:57.015507993 +0200
@@ -3,9 +3,9 @@
pkgbase = pam
pkgver = 1.3.1-1
pkgarch = x86_64
-pkgbuild_sha256sum = 3a72016938e6f3e8660a0f8774b576bf58aa4c7b218948e1fadcf39a3e7ebf9d
-packager = Erich Eckner
-builddate = 1539104335
+pkgbuild_sha256sum = e178fcb37ae20afe3f75b66ec5c29bb9eaf5d5e25d032d62e01e2fc54cf2ed32
+packager = Tobias Powalowski
+builddate = 1529655718
builddir = /build
buildenv = !distcc
buildenv = color
@@ -23,129 +23,129 @@
options = !upx
options = !debug
installed = acl-2.2.53-1-x86_64
-installed = archlinux-keyring-20181003-1-any
+installed = archlinux-keyring-20180404-1-any
installed = argon2-20171227-3-x86_64
installed = attr-2.4.48-1-x86_64
-installed = audit-2.8.4-2-x86_64
installed = autoconf-2.69-4-any
-installed = automake-1.16.1-1-any
+installed = automake-1.15.1-1-any
installed = bash-4.4.023-1-x86_64
-installed = binutils-2.31.1-3-x86_64
+installed = binutils-2.30-5-x86_64
installed = bison-3.0.5-1-x86_64
-installed = bzip2-1.0.6-8-x86_64
-installed = ca-certificates-20180821-1-any
-installed = ca-certificates-mozilla-3.39-1-x86_64
-installed = ca-certificates-utils-20180821-1-any
-installed = coreutils-8.30-1-x86_64
+installed = bzip2-1.0.6-7-x86_64
+installed = ca-certificates-20170307-1-any
+installed = ca-certificates-cacert-20140824-4-any
+installed = ca-certificates-mozilla-3.37.3-1-x86_64
+installed = ca-certificates-utils-20170307-1-any
+installed = coreutils-8.29-1-x86_64
installed = cracklib-2.9.6-1-x86_64
-installed = cryptsetup-2.0.4-1-x86_64
-installed = curl-7.61.1-3-x86_64
+installed = cryptsetup-2.0.3-2-x86_64
+installed = curl-7.60.0-1-x86_64
installed = db-5.3.28-4-x86_64
-installed = dbus-1.12.10-2-x86_64
-installed = device-mapper-2.02.181-1-x86_64
+installed = dbus-1.12.8-1-x86_64
+installed = device-mapper-2.02.177-5-x86_64
installed = diffutils-3.6-1-x86_64
-installed = docbook-xml-4.5-8-any
+installed = docbook-xml-4.5-7-any
installed = docbook-xsl-1.79.2-4-any
-installed = e2fsprogs-1.44.4-1-x86_64
-installed = expat-2.2.6-1-x86_64
-installed = fakeroot-1.23-1-x86_64
-installed = file-5.34-1-x86_64
-installed = filesystem-2018.8-1-x86_64
+installed = e2fsprogs-1.44.2-1-x86_64
+installed = expat-2.2.5-1-x86_64
+installed = fakeroot-1.22-1-x86_64
+installed = file-5.33-3-x86_64
+installed = filesystem-2018.1-2-x86_64
installed = findutils-4.6.0-2-x86_64
installed = flex-2.6.4-1-x86_64
installed = gawk-4.2.1-1-x86_64
-installed = gc-7.6.8-1-x86_64
-installed = gcc-8.2.1+20180831-1-x86_64
-installed = gcc-libs-8.2.1+20180831-1-x86_64
-installed = gdbm-1.18-1-x86_64
+installed = gc-7.6.6-1-x86_64
+installed = gcc-8.1.1+20180531-1-x86_64
+installed = gcc-libs-8.1.1+20180531-1-x86_64
+installed = gdbm-1.14.1-1-x86_64
installed = gettext-0.19.8.1-2-x86_64
-installed = glib2-2.58.1-1-x86_64
-installed = glibc-2.28-4-x86_64
+installed = glib2-2.56.1-1-x86_64
+installed = glibc-2.27-3-x86_64
installed = gmp-6.1.2-1-x86_64
-installed = gnupg-2.2.10-1-x86_64
-installed = gnutls-3.5.19-2-x86_64
-installed = gpgme-1.11.1-2-x86_64
-installed = gpm-1.20.7.r27.g1fd1941-1-x86_64
+installed = gnupg-2.2.8-1-x86_64
+installed = gnutls-3.5.18-1-x86_64
+installed = gpgme-1.11.1-1-x86_64
+installed = gpm-1.20.7-8-x86_64
installed = grep-3.1-1-x86_64
installed = groff-1.22.3-7-x86_64
-installed = guile-2.2.4-1-x86_64
+installed = guile-2.2.3-1-x86_64
installed = gzip-1.9-1-x86_64
-installed = hwids-20180518-1-any
-installed = iana-etc-20180913-1-any
-installed = icu-62.1-1-x86_64
-installed = iptables-1:1.6.2-3-x86_64
-installed = json-c-0.13.1-2-x86_64
+installed = hwids-20171003-1-any
+installed = iana-etc-20180221-1-any
+installed = icu-61.1-1-x86_64
+installed = iptables-1.6.2-2-x86_64
+installed = json-c-0.13.1-1-x86_64
installed = kbd-2.0.4-1-x86_64
-installed = keyutils-1.5.11-1-x86_64
+installed = keyutils-1.5.10-2-x86_64
installed = kmod-25-1-x86_64
installed = krb5-1.16.1-1-x86_64
installed = less-530-1-x86_64
-installed = libarchive-3.3.3-1-x86_64
+installed = libarchive-3.3.2-2-x86_64
installed = libassuan-2.5.1-1-x86_64
-installed = libatomic_ops-7.6.6-1-x86_64
+installed = libatomic_ops-7.6.4-1-x86_64
installed = libcap-2.25-1-x86_64
installed = libcap-ng-0.7.9-1-x86_64
-installed = libelf-0.174-1-x86_64
+installed = libelf-0.171-1-x86_64
installed = libffi-3.2.1-2-x86_64
installed = libgcrypt-1.8.3-1-x86_64
-installed = libgpg-error-1.32-1-x86_64
+installed = libgpg-error-1.31-1-x86_64
+installed = libidn-1.34-2-x86_64
installed = libidn2-2.0.5-1-x86_64
installed = libksba-1.3.5-1-x86_64
-installed = libldap-2.4.46-2-x86_64
+installed = libldap-2.4.46-1-x86_64
installed = libmnl-1.0.4-1-x86_64
installed = libmpc-1.1.0-1-x86_64
-installed = libnftnl-1.1.1-1-x86_64
-installed = libnghttp2-1.33.0-1-x86_64
+installed = libnftnl-1.1.0-1-x86_64
+installed = libnghttp2-1.31.1-1-x86_64
installed = libnl-3.4.0-1-x86_64
-installed = libpcap-1.9.0-1-x86_64
+installed = libpcap-1.8.1-2-x86_64
installed = libpsl-0.20.2-1-x86_64
-installed = libsasl-2.1.26-13-x86_64
-installed = libseccomp-2.3.3-1-x86_64
+installed = libsasl-2.1.26-12-x86_64
+installed = libseccomp-2.3.2-2-x86_64
installed = libsecret-0.18.6-1-x86_64
installed = libssh2-1.8.0-2-x86_64
-installed = libsystemd-239.2-1-x86_64
+installed = libsystemd-238.133-4-x86_64
installed = libtasn1-4.13-1-x86_64
-installed = libtirpc-1.1.4-1-x86_64
-installed = libtool-2.4.6+42+gb88cebd5-2-x86_64
+installed = libtirpc-1.0.3-2-x86_64
+installed = libtool-2.4.6+40+g6ca5e224-7-x86_64
installed = libunistring-0.9.10-1-x86_64
installed = libusb-1.0.22-1-x86_64
-installed = libutil-linux-2.32.1-2-x86_64
-installed = libxml2-2.9.8-5-x86_64
+installed = libutil-linux-2.32-3-x86_64
+installed = libxml2-2.9.8-2-x86_64
installed = libxslt-1.1.32+3+g32c88216-1-x86_64
-installed = linux-api-headers-4.17.11-1-any
-installed = lz4-1:1.8.3-1-x86_64
+installed = linux-api-headers-4.16.1-1-any
+installed = lz4-1:1.8.2-2-x86_64
installed = m4-1.4.18-1-x86_64
installed = make-4.2.1-2-x86_64
installed = mpfr-4.0.1-1-x86_64
installed = ncurses-6.1-3-x86_64
installed = nettle-3.4-1-x86_64
-installed = npth-1.6-1-x86_64
-installed = openssl-1.1.1-1-x86_64
-installed = p11-kit-0.23.14-1-x86_64
-installed = pacman-5.1.1-1-x86_64
-installed = pacman-mirrorlist-20180912-1-any
-installed = pam-1.3.1-1-x86_64
+installed = npth-1.5-1-x86_64
+installed = openssl-1.1.0.h-1-x86_64
+installed = p11-kit-0.23.12-1-x86_64
+installed = pacman-5.1.0-2-x86_64
+installed = pacman-mirrorlist-20180524-1-any
+installed = pam-1.3.0-2-x86_64
installed = pambase-20171006-1-any
-installed = patch-2.7.6-3-x86_64
+installed = patch-2.7.6-1-x86_64
installed = pcre-8.42-1-x86_64
-installed = pcre2-10.32-1-x86_64
-installed = perl-5.28.0-1-x86_64
-installed = pinentry-1.1.0-4-x86_64
-installed = pkgconf-1.5.3-1-x86_64
+installed = pcre2-10.31-1-x86_64
+installed = perl-5.26.2-1-x86_64
+installed = pinentry-1.1.0-3-x86_64
+installed = pkgconf-1.4.2-2-x86_64
installed = popt-1.16-9-x86_64
installed = procps-ng-3.3.15-1-x86_64
installed = readline-7.0.005-1-x86_64
installed = sed-4.5-1-x86_64
-installed = shadow-4.6-1-x86_64
-installed = sqlite-3.25.2-1-x86_64
-installed = sudo-1.8.25.p1-1-x86_64
-installed = systemd-239.2-1-x86_64
+installed = shadow-4.5-4-x86_64
+installed = sqlite-3.24.0-1-x86_64
+installed = sudo-1.8.23-2-x86_64
+installed = systemd-238.133-4-x86_64
installed = tar-1.30-1-x86_64
installed = texinfo-6.5-1-x86_64
-installed = tzdata-2018e-2-x86_64
-installed = util-linux-2.32.1-2-x86_64
+installed = tzdata-2018e-1-any
+installed = util-linux-2.32-3-x86_64
installed = w3m-0.5.3.git20180125-1-x86_64
installed = which-2.21-2-x86_64
installed = xz-5.2.4-1-x86_64
-installed = zlib-1:1.2.11-3-x86_64
-installed = zstd-1.3.5-1-x86_64
+installed = zlib-1:1.2.11-2-x86_64
Admin
Erich Eckner commented on 09.10.2018 20:47

As can be seen, the new version of systemd pulls in audit, against which then the linking happens.
I would not do anything about this issue (if that’s ok with you, Luke), because:
1st it only affects systems w/o systemd - e.g. non-standard systems
2nd it will solve itself with the next (upstream) release/rebuild of pam (or at least, if upstream does not add audit to the depends, it will become an upstream bug which we should report to them)

regards,
Erich
Luke Shumaker commented on 09.10.2018 21:28

Parabola supports OpenRC, so this risks breaking sudo for Parabola OpenRC users, making it more severe for us downstream than it is for you.

That isn’t to say that you have to take actionand fix it for us; it is a low-priority bug for Arch Linux 32 users, so if you want to wait for it to be resolved in upsteam Arch, that’s your prerogative. But it means that in the mean-time, Parabola will have to repackage it to avoid breaking our OpenRC users’ boxes.
bill auger commented on 10.10.2018 01:16

related to: https://bugs.archlinux.org/task/60365

Google Cache

61Packages: StableBug ReportMediumLowdmd fails to build with evalu8.d:function evalu8(elem ....New
0%
Task Description

01.05.2019 - From the discusison in: https://forum.dlang.org/thread/dsrjmpnavxqsjqmlvotf@forum.dlang.org. Well the problem is that the mangling produced …

63Packages: StableBug ReportMediumLownodejs crashes in libuv when cleaning up FSReqCallbackNew
0%
Task Description

Attached to Project: Archlinux32
Opened by Andreas Baumann - 07.02.2019
FS#63 - nodejs crashes in libuv when cleaning up FSReqCallback

Program terminated with signal SIGSEGV, Segmentation fault.
#0 0×00945919 in node::fs::FSReqCallback::~FSReqCallback() ()
[Current thread is 1 (Thread 0xb5614880 (LWP 2013))]
(gdb) bt
#0 0×00945919 in node::fs::FSReqCallback::~FSReqCallback() ()
#1 0×00937274 in node::fs::FSReqAfterScope::~FSReqAfterScope() ()
#2 0x0093767d in node::fs::AfterInteger(uv_fs_s*) ()
#3 0xb7e910e0 in uv.work_done () from /usr/lib/libuv.so.1
#4 0xb7e9526e in ?? () from /usr/lib/libuv.so.1
#5 0xb7ea51f8 in uv.io_poll () from /usr/lib/libuv.so.1
#6 0xb7e95c51 in uv_run () from /usr/lib/libuv.so.1
#7 0x00905d37 in node::Start(v8::Isolate*, node::IsolateData*, std::vector, std::allocator >, std::allocator, std::allocator > > > const&, std::vector, std::allocator >, std::allocator, std::allocator > > > const&) ()
#8 0×00903655 in node::Start(int, char**) ()
#9 0x008acef1 in main ()

This affects gyp, vault and probably some other packages, depending whether those callbacks are used or not.

  Comments (1)
  Related Tasks (0/0)

Admin
Andreas Baumann commented on 07.02.2019 09:36

See also mailing list thread:

https://lists.archlinux.org/pipermail/arch-ports/2018-November/000835.html

Google Code

67Packages: StableBug ReportMediumLowldc segfault - Arch LinuxNew
0%
Task Description

01.05.2019 - Program terminated with signal SIGSEGV, Segmentation fault. #0 0xb30d3329 in getenv () from /usr/lib/libc.so.6 (gdb) bt #0 0xb30d3329 in …

68Packages: Build-listBug ReportMediumLowdmd rebuild results in gen_man segfaultNew
0%
Task Description

FS#68 : dmd rebuild results in gen_man segfault
Opened by Andreas Baumann - 01.05.2019. FS#68 - dmd rebuild results in gen_man segfault. make: Entering directory ‘/build/dmd/src/dmd/docs’ …

70Packages: Build-listBug ReportMediumLowchromium not available for i686 (fails in compiler intr...New
0%
Task Description

Attached to Project: Archlinux32
Opened by Andreas Baumann - 10.05.2019
FS#70 - chromium needs SSE2

chromium starts, but every page it loads ends in “Aw snap” and on the console:

Check failed: cpu.has_sse2().

Google Cache

82Packages: StableBug ReportMediumLow[glibc] ld warning: /usr/lib32/ld-linux.so.2: corrupt G...New
0%
Task Description

Attached to Project: Archlinux32
Opened by Jeff Hodd - 11.07.2019
Last edited by Andreas Baumann - 09.08.2019
FS#82 - [glibc] ld warning: /usr/lib32/ld-linux.so.2: corrupt GNU_PROPERTY_TYPE (5) size: 0

All software builds are producing this warning. Some builds are failing because of the error return on linking. I’m also seeing failures on LD_PRELOADs.

/bin/ld: warning: /usr/lib/ld-linux.so.2: corrupt GNU_PROPERTY_TYPE (5) size: 0

Easy to reproduce. Just build this program:

# test.c
# Compiled with ‘gcc test.c’ int main() {

  return 0;

}

This was reported at bugs.archlinux.org (reference https://bugs.archlinux.org/task/63015) where it was closed and considered fixed if built using the –enable-cet flag. I built glibc with the –enable-cet flag, but am still seeing the failures, so not fixed.
Closed by Andreas Baumann
09.08.2019 11:44
Reason for closing: Fixed

  Comments (6)
  Related Tasks (0/0)

Jeff Hodd commented on 16.07.2019 03:29

I’ve narrowed down the glibc upgrade to glibc-2.29-1.26 -> glibc-2.29-1.27. The error doesn’t occur with glibc-2.29-1.26. There were 3 changes made to the arch32 PKGBUILD for the glibc-2.29-1.27 release. One of them caused this issue.
Admin
Andreas Baumann commented on 16.07.2019 05:33

There is another thing which can change: the toolchain.
This GNU_PROPERTY error is something the compiler emits (we think it’s CET stuff, but it’s badly
documented). Binutils ld seems not to like this ELF section.

The error is the same as in:

https://bugs.archlinux.org/task/63015

What’s puzzling me: –enable-cet is there in glibc, gcc, binutils (just not for i486, as CET doesn’t\
work for older CPUs).

Commit: 09d03cbd4c57b8eabfadd22b67929d958b2409d7 and d57a456faa674c24e8869a26a14c497c95accf1f in
glibc are mine, they try to change stack alignment and handling of SSE for pentium4 for Java, also without effect.
Admin
Andreas Baumann commented on 16.07.2019 05:35

About linker warnings being turned to errors (as for compiler warnings turned to errors): this
is something the DEVELOPER should do, NOT the PACKAGER. Released software should:
- NOT include asserts
- NOT include debug code
- NOT include code only used for running tests
- NOT use -Werror
- NOT use -Wl,–fatal-warnings

See for instance extra-cmake-modules-5.59.0-ld-no-fatal-warning.patch.
Jeff Hodd commented on 16.07.2019 21:50

I knew about the cet issue. Did quite abit of looking around to get some insight into it (even looked at the code - elf-properties.c - and it looks like the Elf_Internal_Note description size is coming back with a value of 0. the other possibility is that (size % 4) is something other than 0 which is less likely). From what i could gather, cet is supposed to be enabled in the latest builds of glibc for i686 even though, as you pointed out, it’s not well documented. I did do a 2.29-4 i686 build with cet enabled and it made no difference vis-a-vis the warning. I also checked the upstream diff between 2.29-1.26 and 2.29-1.27 and noticed the addition of –enable-static-pie and thought maybe position independent executables may explain it. Did another glibc build with static pie disabled and that made no difference. Am about to go back and check the diff again and see what else may have changed.

I did check the CMakeLists.txt file for my failing build and it uses -Werror and -Wl,–fatal-warnings so I will remove those. But that doesn;t actually fix the underlying issue of the warning which we shouldn;t be seeing.

It is up to the developer, but too often one has to show that a change fixes an issue before you’ll get any attention. I may not be THE developer for this particular package, but I am A developer (in general), so I don;t feel uncomfortable making code changes.

I’ll keep looking around for differences between the 1.26 and 1.27 builds.
Jeff Hodd commented on 16.07.2019 22:15

if (note->descsz < 8 || (note->descsz % align_size) != 0)

  {

bad_size:

    _bfd_error_handler
(_("warning: %pB: corrupt GNU_PROPERTY_TYPE (%ld) size: %#lx"),
 abfd, note->type, note->descsz);
    return FALSE;
  }

The warning is printing out the description size - and that’s 0.

Apparently it’s supposed to be >= 8 and divisible by 4:

unsigned int align_size = bed->s->elfclass == ELFCLASS64 ? 8 : 4;

I am assuming that arch32 doesn’t support ELFCLASS64.
Jeff Hodd commented on 22.07.2019 17:13

https://bbs.archlinux32.org/viewtopic.php?id=2770

Google Cache

103Packages: StableBug ReportMediumLowyarn segfaultsNew
0%
Task Description

experienced when building buildbot-www

/bin/sh: line 1: 4744 Segmentation fault (core dumped) yarn install –pure-lockfile

109PackagesBug ReportMediumLowgcc10 -fno-common breaks jdkNew
0%
Task Description

/usr/bin/ld: /build/java-openjdk/src/jdk14u-jdk-14.0.1+7/build/linux-x86-server-release/support/native/java.base/libjava/childproc.o:/build/java-openjdk/src/jdk14u-jdk-14.0.1+7/src/java.base/unix/native/libjava/childproc.h:129: multiple definition of `parentPathv’; /build/java-openjdk/src/jdk14u-jdk-14.0.1+7/build/linux-x86-server-release/support/native/java.base/libjava/ProcessImpl_md.o:/build/java-openjdk/src/jdk14u-jdk-14.0.1+7/src/java.base/unix/native/libjava/childproc.h:129: first defined here

collect2: error: ld returned 1 exit status

This is fixed known and fixed upstream (without just setting
-fcommon again):

https://bugs.openjdk.java.net/browse/JDK-8235903

116PackagesBug ReportMediumLowRace causes iptables not to be ready after startupNew
0%
Task Description

Nov 06 08:04:01 eurohp1 systemd[1]: Starting IPv4 Packet Filtering Framework… Nov 06 08:04:01 eurohp1 iptables-restore[287]: Another app is currently holding the xtables lock. Perhap>
Nov 06 08:04:01 eurohp1 systemd[1]: iptables.service: Main process exited, code=exited, status=4/NOPERMI>
Nov 06 08:04:01 eurohp1 systemd[1]: iptables.service: Failed with result ‘exit-code’.
Nov 06 08:04:01 eurohp1 systemd[1]: Failed to start IPv4 Packet Filtering Framework.

Works when starting iptables later manually.

This is security relevant as not having a firewall after startup puts the system at risk.

117PackagesBug ReportVery LowLowvboxdrive module missingNew
0%
Task Description

vboxdrv module is missing making virtualbox unusable.

I’m currently running kernel 5.9.0-1.0-pae but it doesn’t seem to be there in any version

126PackagesBug ReportMediumLowlua hooks break in TeX on i686New
0%
Task Description
PANIC: unprotected error in call to Lua API (CPU with SSE2 required)
PANIC: unprotected error in call to Lua API (CPU with SSE2 required)
fmtutil [ERROR]: running `luajittex -ini   -jobname=luajittex -progname=luajittex luatex.ini </dev/null' return status: 1
fmtutil [ERROR]: cannot copy log luajittex.log to: /var/lib/texmf/web2c/luajittex
fmtutil [ERROR]: returning error due to option --strict
fmtutil [ERROR]: running `luajithbtex -ini   -jobname=luajithbtex -progname=luajithbtex luatex.ini </dev/null' return status: 1
fmtutil [ERROR]: cannot copy log luajithbtex.log to: /var/lib/texmf/web2c/luajithbtex
fmtutil [ERROR]: returning error due to option --strict
error: command failed to execute correctly
132PackagesBug ReportMediumLowOLPC-XO-1 kernel, usb8xx module crashingNew
0%
Task Description
[   21.686772] usb8xxx: Firmware ready event received
[   21.717061] usb8xxx 1-1:1.0 (unnamed net_device) (uninitialized): 00:17:c4:10:e3:67, fw 5.110.22p23, cap 0x000003a3
[   21.897489] usb8xxx 1-1:1.0 wlan0: Marvell WLAN 802.11 adapter
[   22.004871] usb8xxx 1-1:1.0 wlan0: PREP_CMD: command 0x0074 failed: 2
[   22.109002] usb8xxx 1-1:1.0 wlan0: Firmware does not seem to support PS mode
[   22.217405] usb8xxx 1-1:1.0 wlan0: PREP_CMD: command 0x0043 failed: 1
[   22.318862] usb8xxx 1-1:1.0 wlan0: HOST_SLEEP_CFG failed 1
[   23.468484] usb8xxx 1-1:1.0 wlp0s15f5u1: renamed from msh0
[   43.523176] ------------[ cut here ]------------
[   43.556197] WARNING: CPU: 0 PID: 148 at net/wireless/core.c:1346 cfg80211_netdev_notifier_call+0x102/0x31e
[   43.625361] Modules linked in: input_leds led_class usb8xxx libertas serio_raw
[   43.664224] CPU: 0 PID: 148 Comm: wpa_supplicant Not tainted 5.10.5-arch1-1.0-olpc-xo1 #1
[   43.715531] Hardware name: OLPC XO/XO, BIOS OLPC Ver 1.00.01 06/11/2014
[   43.754829] EIP: cfg80211_netdev_notifier_call+0x102/0x31e
[   43.792862] Code: ff 89 f0 e8 4d fc ff ff 8b 46 7c 85 c0 74 2a 39 58 34 75 25 80 78 64 00 75 16 8b 96 80 00 00 00 85 d2 74 06 80 7a 64 00 75 06 <0f> 0b c6 40 62 01 31 d2 89 f0 e8 3d 7a 00 00 8b 86 88 00 00 00 8b
[   43.911511] EAX: c36e1d00 EBX: c2cb8800 ECX: ffffffff EDX: 00000000
[   43.958939] ESI: c341c000 EDI: c1f7d000 EBP: c1eebdd4 ESP: c1eebdbc
[   44.002464] DS: 007b ES: 007b FS: 0000 GS: 00e0 SS: 0068 EFLAGS: 00010246
[   44.045454] CR0: 80050033 CR2: b69e5428 CR3: 01ff0000 CR4: 00000090
[   44.088019] Call Trace:
[   44.126010]  ? fib_disable_ip+0x2a/0x2d
[   44.165297]  ? cfg80211_register_wdev+0x46/0x46
[   44.208941]  notifier_call_chain+0x2a/0x4e
[   44.252482]  raw_notifier_call_chain+0xc/0xe
[   44.296501]  call_netdevice_notifiers_info+0x5d/0x64
[   44.338599]  call_netdevice_notifiers+0x18/0x1a
[   44.379580]  __dev_notify_flags+0x4a/0x7c
[   44.419064]  dev_change_flags+0x3d/0x46
[   44.464304]  devinet_ioctl+0x260/0x4cd
[   44.502437]  inet_ioctl+0x139/0x163
[   44.539766]  ? dev_name_hash+0x20/0x36
[   44.577060]  ? dev_get_by_name_rcu+0x1c/0x2f
[   44.614874]  ? dev_ioctl+0x2e4/0x40e
[   44.651928]  ? inet_recvmsg+0x77/0x77
[   44.692778]  sock_ioctl+0x2ad/0x36f
[   44.730157]  ? preempt_count_add+0x4a/0x4f
[   44.771397]  ? ____sys_recvmsg+0xbc/0xbc
[   44.808485]  vfs_ioctl+0x1a/0x24
[   44.847256]  __ia32_sys_ioctl+0x5aa/0x5c4
[   44.891962]  ? debug_smp_processor_id+0x12/0x14
[   44.930996]  ? fpregs_assert_state_consistent+0x17/0x34
[   44.967562]  ? exit_to_user_mode_prepare+0x84/0x94
[   45.002448]  do_int80_syscall_32+0x2c/0x39
[   45.035656]  entry_INT80_32+0xf3/0xf3
[   45.067762] EIP: 0xb790ffc4
[   45.097915] Code: 83 c4 0c 89 d8 5b 5e 5f 5d c3 66 90 66 90 66 90 66 90 66 90 66 90 53 8b 54 24 10 8b 4c 24 0c 8b 5c 24 08 b8 36 00 00 00 cd 80 <5b> 3d 01 f0 ff ff 0f 83 a0 3f f3 ff c3 66 90 66 90 66 90 66 90 66
[   45.199342] EAX: ffffffda EBX: 00000007 ECX: 00008914 EDX: bffe736c
[   45.233187] ESI: bffe736c EDI: 0076c850 EBP: 00000000 ESP: bffe7348
[   45.266705] DS: 007b ES: 007b FS: 0000 GS: 0033 SS: 007b EFLAGS: 00000296
[   45.300799] ---[ end trace 20811b76aa348f84 ]---
[   64.909322] IPv6: ADDRCONF(NETDEV_CHANGE): wlp0s15f5u1: link becomes ready

Warm reboot a second time seems to help.

136PackagesBug ReportMediumLowHaskell probably completely fails to rebuildNew
0%
Task Description
Configuring attoparsec-0.13.2.4...
Error:
    The following packages are broken because other packages they depend on are missing. These broken packages must be rebuilt before they can be used.
installed package tasty-1.3.1 is broken due to missing package ansi-terminal-0.11-2SXi8ZhU18i2uWLidRUotS, async-2.2.2-K8T9LglWxlG5HgD5vvGjbo, optparse-applicative-0.16.1.0-JDPEASK1GJS1Nsq2qjjZCq
installed package tasty-quickcheck-0.10.1.2 is broken due to missing package QuickCheck-2.14.2-io0WylueSG4seqSTUQCKM, optparse-applicative-0.16
141DevopsBug ReportMediumLowmake iso build more reliablyNew
0%
Task Description

Currently, the iso build are several bash scripts on several machines requiring to move stuff via sshfs and alike.

This should become more stable - ideally some single script/package/systemd-unit with proper error reporting (email or irc come to my mind)

143PackagesBug ReportMediumLowthunderbird doesn't build and runNew
0%
Task Description

still linked against icu67.

Same here, I cannot believe that somebody is actually using thunderbird on Archlinux32 anymore.

Triggered rebuild, doesn’t build currently.

162PackagesBug ReportMediumLowbrowsers based on Chromium break in secomp sanboxingNew
0%
Task Description

Everything using chromium/seccomp jailing breaks currently including chromium due to missing IA-32
rules in libseccomp and/or chromium itself.

Firefox seems to work fine.
epiphany works.
midori works.
luakit works.

Chromium crashes with sigsegv (I would expect something which reminds me of a seccomp syscall?).

konqueror, falkon, qutebrowser are based on qt5-webengine. They all open up but then don’t render a page (issuing the seccomp error messages attached below).

vivaldi the same, but as it is closed source, we cannot fix it.

163PackagesBug ReportMediumLowsphinx_rtd_theme is used to build documentation but doe...New
0%
Task Description
build
running build_py
npm WARN npm npm does not support Node.js v15.9.0
npm WARN npm You should probably upgrade to a newer version of node as we
npm WARN npm can't make any promises that npm will work with this version.
npm WARN npm Supported releases of Node.js are the latest release of 6, 8, 9, 10, 11, 12, 13.
npm WARN npm You can find the latest version at https://nodejs.org/

> sphinx_rtd_theme@0.5.1 preinstall /build/python-sphinx_rtd_theme/src/sphinx_rtd_theme-0.5.1
> bin/preinstall.js

Traceback (most recent call last):
  File "/build/python-sphinx_rtd_theme/src/sphinx_rtd_theme-0.5.1/setup.py", line 86, in <module>
    setup(
  File "/usr/lib/python3.9/site-packages/setuptools/__init__.py", line 153, in setup
    return distutils.core.setup(**attrs)
  File "/usr/lib/python3.9/distutils/core.py", line 148, in setup
    dist.run_commands()
  File "/usr/lib/python3.9/distutils/dist.py", line 966, in run_commands
    self.run_command(cmd)
  File "/usr/lib/python3.9/distutils/dist.py", line 985, in run_command
    cmd_obj.run()
  File "/usr/lib/python3.9/distutils/command/build.py", line 135, in run
    self.run_command(cmd_name)
  File "/usr/lib/python3.9/distutils/cmd.py", line 313, in run_command
    self.distribution.run_command(command)
  File "/usr/lib/python3.9/distutils/dist.py", line 985, in run_command
    cmd_obj.run()
  File "/build/python-sphinx_rtd_theme/src/sphinx_rtd_theme-0.5.1/setup.py", line 22, in run
    subprocess.run(['npm', 'install'], check=True)
  File "/usr/lib/python3.9/subprocess.py", line 524, in run
    raise CalledProcessError(retcode, process.args,
subprocess.CalledProcessError: Command '['npm', 'install']' died with <Signals.SIGSEGV: 11>.
==> ERROR: A failure occurred in build().
    Aborting...
==> ERROR: Build failed, check /var/lib/archbuild/staging-pentium4/abaumann/build
164PackagesBug ReportMediumLowpam_systemd.so hangs openssh 2 out of 3 timesNew
0%
Task Description

Effect: you can not log in.
The SSHd child runs on 100% CPU doing something.
This happens on i486, i686 and pentium4 equally.

166PackagesBug ReportMediumLows2n-tls: failing testsNew
0%
Task Description

The following tests FAILED:

       91 - s2n_pq_kem_hybrid_kat_test (Failed)
      145 - s2n_session_ticket_test (Failed)
      154 - s2n_stuffer_network_order_test (Failed)
      184 - s2n_x509_validator_test (Failed)

https://github.com/aws/s2n-tls/issues/2405 https://github.com/aws/s2n-tls/issues/2406 https://github.com/aws/s2n-tls/issues/2404

3 are known upstream too.

176DevopsFeature RequestMediumLowbring back archiso32 dual bootNew
0%
Task Description

We should make archiso32 be able to build a i686- and x86_64-bootable iso, again. This is really handy on a usb stick as a rescue system.

The problem with the old dual iso is, that I had to do the i686 iso from scratch, because upstream changed from build.sh to putting everything into mkarchiso. Now, everything is steered from a profile file.

So either, we find a way to make a profile for multiple architectures, or we need to patch mkarchiso to do that for us - and maybe upstream these changes.

180Packages: StableBug ReportVery LowLowPandoc requires specific-version haskell dependenciesNew
0%
Task Description
# pandoc --version
pandoc: error while loading shared libraries: libHSzip-archive-0.4.1-4yLWnBS0zifKkvfHVbmUo1-ghc8.10.2.so: cannot open shared object file: No such file or directory
<code>

Versions:
<code>
# pacman -Q | grep haskell
haskell-aeson 1.5.4.1-19.0
haskell-aeson-pretty 0.8.8-94.0
haskell-ansi-terminal 0.11-17.0
haskell-asn1-encoding 0.9.6-58.0
haskell-asn1-parse 0.9.5-58.0
haskell-asn1-types 0.3.4-37.0
haskell-assoc 1.0.2-27.0
haskell-async 2.2.2-40.0
haskell-attoparsec 0.13.2.4-36.0
haskell-base-compat 0.11.2-4.2
haskell-base-compat-batteries 0.11.2-11.0
haskell-base-orphans 0.8.3-14.0
haskell-base16-bytestring 0.1.1.7-3.0
haskell-base64-bytestring 1.2.0.1-3.0
haskell-basement 0.0.11-10.1
haskell-bifunctors 5.5.8-13.0
haskell-blaze-builder 0.4.2.1-2.1
haskell-blaze-html 0.9.1.2-57.0
haskell-blaze-markup 0.8.2.7-41.0
haskell-byteable 0.1.1-22.1
haskell-case-insensitive 1.2.1.0-39.0
haskell-cereal 0.5.8.1-9.0
haskell-citeproc 0.3.0.9-9.0
haskell-cmdargs 0.10.21-1.0
haskell-colour 2.3.5-75.0
haskell-commonmark 0.1.1.2-2.0
haskell-commonmark-extensions 0.2.0.3-1.0
haskell-commonmark-pandoc 0.2.0.1-24.0
haskell-comonad 5.0.6-58.0
haskell-conduit 1.3.4-3.0
haskell-conduit-extra 1.3.5-70.0
haskell-connection 0.3.1-99.0
haskell-cookie 0.4.5-9.1
haskell-cryptonite 0.27-32.0
haskell-data-default 0.7.1.1-87.0
haskell-data-default-class 0.1.2.0-21.1
haskell-data-default-instances-containers 0.0.1-33.1
haskell-data-default-instances-dlist 0.0.1-100.0
haskell-data-default-instances-old-locale 0.0.1-33.1
haskell-data-fix 0.3.0-35.0
haskell-digest 0.0.1.2-22.1
haskell-distributive 0.6.2-40.0
haskell-dlist 1.0-23.0
haskell-doclayout 0.3-45.0
haskell-doctemplates 0.9-40.0
haskell-emojis 0.1-47.0
haskell-erf 2.0.0.0-21.0
haskell-errors 2.3.0-59.1
haskell-file-embed 0.0.13.0-3.1
haskell-glob 0.10.1-28.0
haskell-haddock-library 1.9.0-58.0
haskell-hashable 1.3.0.0-36.0
haskell-hourglass 0.2.12-82.0
haskell-hslua 1.3.0-2.0
haskell-hslua-module-system 0.2.2.1-17.0
haskell-hslua-module-text 0.3.0.1-5.0
haskell-hsyaml 0.2.1.0-52.0
haskell-http 4000.3.15-49.0
haskell-http-client 0.7.6-14.0
haskell-http-client-tls 0.3.5.3-359.0
haskell-http-types 0.12.3-100.0
haskell-hxt 9.3.1.18-196.0
haskell-hxt-charproperties 9.5.0.0-1.0
haskell-hxt-regex-xmlschema 9.2.0.7-2.0
haskell-hxt-unicode 9.0.2.4-22.0
haskell-indexed-traversable 0.1.1-3.1
haskell-integer-logarithms 1.0.3.1-3.1
haskell-ipynb 0.1.0.1-192.0
haskell-jira-wiki-markup 1.3.2-27.0
haskell-juicypixels 3.3.5-37.0
haskell-memory 0.15.0-49.0
haskell-mime-types 0.1.0.9-11.1
haskell-mono-traversable 1.0.15.1-74.0
haskell-network 3.1.2.1-1.0
haskell-network-uri 2.6.3.0-217.0
haskell-old-locale 1.0.0.7-27.1
haskell-old-time 1.1.0.3-27.1
haskell-pandoc-types 1.22-13.0
haskell-pem 0.2.4-114.0
haskell-primitive 0.7.1.0-29.0
haskell-quickcheck 2.14.2-11.0
haskell-random 1.2.0-54.0
haskell-resourcet 1.2.4.2-31.0
haskell-safe 0.3.19-5.1
haskell-scientific 0.3.6.2-53.0
haskell-sha 1.6.4.4-16.1
haskell-skylighting 0.10.2-24.0
haskell-skylighting-core 0.10.2-24.0
haskell-socks 0.6.1-90.0
haskell-split 0.2.3.4-88.0
haskell-splitmix 0.1.0.3-5.0
haskell-streaming-commons 0.2.2.1-28.1
haskell-strict 0.4.0.1-1.0
haskell-syb 0.7.1-8.0
haskell-tagged 0.8.6.1-2.2
haskell-tagsoup 0.14.8-75.0
haskell-temporary 1.3-130.0
haskell-texmath 0.12.0.3-40.0
haskell-text-conversions 0.3.1-62.0
haskell-text-icu 0.7.0.1-37.1
haskell-th-abstraction 0.4.2.0-2.2
haskell-th-compat 0.1-12.0
haskell-these 1.1.1.1-28.0
haskell-time-compat 1.9.5-1.0
haskell-tls 1.5.5-3.0
haskell-transformers-compat 0.6.6-3.1
haskell-typed-process 0.2.6.0-63.0
haskell-unicode-transforms 0.3.7.1-42.0
haskell-uniplate 1.6.13-4.0
haskell-unliftio-core 0.2.0.1-6.1
haskell-unordered-containers 0.2.13.0-11.0
haskell-utf8-string 1.0.1.1-20.0
haskell-uuid-types 1.0.3-58.0
haskell-vector 0.12.1.2-64.0
haskell-vector-algorithms 0.8.0.4-1.0
haskell-x509 1.7.5-137.0
haskell-x509-store 1.6.7-136.0
haskell-x509-system 1.6.6-204.0
haskell-x509-validation 1.6.11-136.0
haskell-xml 1.3.14-27.2
haskell-xml-conduit 1.9.0.0-77.0
haskell-xml-types 0.3.8-5.1
haskell-zip-archive 0.4.1-66.0
haskell-zlib 0.6.2.2-4.0
196PackagesBug ReportMediumLowupdate filesystemNew
0%
Task Description

b3da2fc1c25065a1bd09f9930eeed1d11dc312e4 only updated half the package - we’re missing:

- update the logo
- update the url (?)
- only if both are done: updating the hash on top of the PKGBUILD

228PackagesBug ReportMediumLow[icu69] not updated packagesNew
0%
Task Description

starting to collect them here packages which require icu69 (and have thus not been rebuilt
for icu 70 yet):

- abiword: libical (rescheduled build)

231PackagesBug ReportMediumLow[libffi] packages needing a rebuildNew
0%
Task Description
'pypy_plugin.so' -> '/build/uwsgi/pkg/uwsgi-plugin-pypy/usr/lib/uwsgi/pypy_plugin.so'
install: creating directory '/build/uwsgi/pkg/uwsgi-plugin-pypy/opt'
install: creating directory '/build/uwsgi/pkg/uwsgi-plugin-pypy/opt/pypy'
install: creating directory '/build/uwsgi/pkg/uwsgi-plugin-pypy/opt/pypy/site-packages'
'uwsgidecorators.py' -> '/build/uwsgi/pkg/uwsgi-plugin-pypy/opt/pypy/site-packages/uwsgidecorators.py'
pypy: error while loading shared libraries: libffi.so.6: cannot open shared object file: No such file or directory
240PackagesBug ReportMediumLow[qt5-base] i486 builds run out of memory due to LTONew
0%
Task Description

LTO is hard to switch off, there are flags doing nothing, I see errors like

lto-wrapper: fatal error: write: No space left on device

245PackagesBug ReportMediumLow[opencv] Python stack smashingNew
0%
Task Description

– Found PythonInterp: /usr/bin/python3 (found suitable version “3.10.4”, minimum required is “3.2”)
– Found PythonLibs: /lib/libpython3.10.so (found suitable exact version “3.10.4”)
* stack smashing detected *: terminated

Building falls through, only in package() we see the errors then:

rm: cannot remove ‘/build/opencv/pkg/opencv/usr/lib/python3*’: No such file or directory
=⇒ ERROR: A failure occurred in package_opencv().

Happens on real i486, not in staging-i486-build, making it even more annoying.

This blocks gstreamer with the opencv plugin..

246PackagesBug ReportMediumLow[blender] doesn't work (and doesn't build)New
0%
Task Description

blender 2.93 has dependencies on wrong versions of
- llvm (via openshadinglanguage)
- boost (via openimageio)

Could NOT find PythonLibsUnix (missing: PYTHON_LIBRARY PYTHON_LIBPATH PYTHON_INCLUDE_DIR PYTHON_INCLUDE_CONFIG_DIR)’

blender 3.0.1:
Haru not found, disabling WITH_HARU’ and ‘Cycles OSL requires WITH_LLVM, the library may not have been found. Configure LLVM or disable WITH_CYCLES_OSL

Let’s tackle one issue after the other. :-)

248PackagesBug ReportMediumLow[Qt6] Illegal OpcodesNew
0%
Task Description
кві 09 19:43:36 alizee kernel: traps: telegram-deskto[1252] trap invalid opcode ip:b3f990c3 sp:bf8d0010 error:0 in libQt6Gui.so.6.2.3[b3ecb000+873000]

Stack trace of thread 1252:
#0  0x00000000b3f990c3 n/a (libQt6Gui.so.6 + 0xce0c3)
#1  0x00000000b7f67ecb call_init (ld-linux.so.2 + 0x5ecb)
#2  0x00000000b7f67fc4 _dl_init (ld-linux.so.2 + 0x5fc4)
#3  0x00000000b7f7f58a _dl_start_user (ld-linux.so.2 + 0x1d58a)
ELF object binary architecture: Intel 80386
кві 09 19:45:11 alizee kernel: traps: qbittorrent[1353] trap invalid opcode ip:b60c69b6 sp:bfd54e70 error:0 in libQt6Core.so.6.2.3[b5f22000+2fd000]

Stack trace of thread 1353:
#0  0x00000000b60c69b6 _Z26qCalculateGrowingBlockSizeiii (libQt6Core.so.6 + 0x21c9b6)
#1  0x00000000b60c6aa9 _ZN10QArrayData8allocateEPPS_iiiNS_16AllocationOptionE (libQt6Core.so.6 + 0x21caa9)
#2  0x00000000b61e9cef n/a (libQt6Core.so.6 + 0x33fcef)
#3  0x00000000b61139a4 _ZN18QThreadStorageDataC2EPFvPvE (libQt6Core.so.6 + 0x2699a4)
#4  0x00000000b656aca9 n/a (libQt6Network.so.6 + 0x31ca9)
#5  0x00000000b7f68ecb call_init (ld-linux.so.2 + 0x5ecb)
#6  0x00000000b7f68fc4 _dl_init (ld-linux.so.2 + 0x5fc4)
#7  0x00000000b7f8058a _dl_start_user (ld-linux.so.2 + 0x1d58a)
ELF object binary architecture: Intel 80386
250PackagesBug ReportMediumLow[luajit] Illegal instruction on i686, i486New
0%
Task Description

Happens for instance when starting mpv.

252PackagesBug ReportMediumLow[dbus-python/python-dbus] mixupNew
0%
Task Description

packages (like upower) which include a dependency on python-dbus
use a 3.9 version and miss the correct one dbus-python (which
replaces python-dbus). This will only solve itself when upstream
adapts the PKGBUILDs to this name change.

254PackagesBug ReportMediumLow[libadwaita/gtk4/tracker3]New
0%
Task Description
/usr/bin/ld: warning: libicuuc.so.69, needed by /usr/lib/libtracker-sparql-3.0.so, not found (try using -rpath or -rpath-link)
/usr/bin/ld: warning: libicui18n.so.69, needed by /usr/lib/libtracker-sparql-3.0.so, not found (try using -rpath or -rpath-link)
/usr/bin/ld: /usr/lib/libtracker-sparql-3.0.so: undefined reference to `unorm2_getNFKCInstance_69'
/usr/bin/ld: /usr/lib/libtracker-sparql-3.0.so: undefined reference to `u_strToLower_69'
/usr/bin/ld: /usr/lib/libtracker-sparql-3.0.so: undefined reference to `ubrk_first_69'

tracker3 is not rebuilding on i486:

tracker/docs/reference/libtracker-sparql/meson.build:78:7: ERROR: Unknown variable "tracker_sparql_gir".
255PackagesBug ReportVery LowLow[seamonkey] Does not start, needs rebuildingNew
0%
Task Description

Seamonkey is built with now outdated versions of libffi and icu (69). Neither pentium4 nor i686 build starts right now.

257PackagesBug ReportMediumLow[openjdk 11/17/18] fails to build almost in all version...New
0%
Task Description

no task description

108Packages: StagingBug ReportVery LowHighlldb fails to run any binary (error: failed to launch o...Unconfirmed
0%
Task Description

Very easy to reproduce. lldb version 10.0.0, just try to run any binary.

[aeden@arch32 bin]$ lldb $(which date)
(lldb) target create “/usr/bin/date” Current executable set to ‘/usr/bin/date’ (i386).
(lldb) run
error: failed to launch or debug process
(lldb)

172PackagesBug ReportVery LowMediumiwd requires some kernel flagsUnconfirmed
0%
Task Description

RC4 support not found
The following options are missing in the kernel:

CONFIG_CRYPTO_USER_API_SKCIPHER
CONFIG_CRYPTO_ECB
CONFIG_CRYPTO_ARC4
210PackagesBug ReportVery LowMediumkeymap don't gets fixed on login as set in /etc/vconsol...Unconfirmed
0%
Task Description

gzip comes with asm code, if enabled, built a TEXTREL which gets bloqued on boot, so systemd don’t set keymap
A lot of tricks in forums, old thread more complete here $506 An old problem. Work around while asm gets fixed is call configure with DEFS=”NO_ASM” like this:

...
export DEFS="NO_ASM"
./configure ....

or,

./configure DEFS="NO_ASM" ....

I have not tested it, but gentoo on x32 have gzip like this and no TEXTRELS here.
No matter i486, i686 or pentium.

Hope it helps.

Best regards.

100Packages: StableBug ReportVery LowLowmldonkey crashesUnconfirmed
0%
Task Description

All versions of mldonkey crash in arch32 updated. (segmentation fault and core dumped)

209PackagesBug ReportVery LowLowIntel High Definition Audio issue.Unconfirmed
0%
Task Description

I am using Arch Linux 32 latest version on Sony VAIO VGN-FS215Z . The following is the audio device:

-fs215z:~$ lspci | grep -i audio

00:1b.0 Audio device: Intel Corporation 82801FB/FBM/FR/FW/FRW (ICH6 Family) High Definition Audio Controller (rev 03)

When I boot the system after some time getting crackling sound in speaker. Sometimes it stops after few minutes and sometimes continue to sound. Really annoying. I am not getting the normal audio in any application. This problem was there in debian based OSs also but not there in any other OS.

Please help.

Showing tasks 1 - 44 of 44 Page 1 of 1

Available keyboard shortcuts

Tasklist

Task Details

Task Editing