Bugs in Archlinux32 packages, specific to 32-bit issues.

Bugs  FS#2  to  FS#92  have been recovered and may be incomplete, the
recovered Google/Bing cache data can be found here.

IDCategoryTask TypePrioritySeveritySummaryStatus  ascProgress
310PackagesBug ReportMediumLow[webkit2gtk] needs a running RubyNew
0%
Task Description
<internal:/usr/lib/ruby/3.0.0/rubygems/core_ext/kernel_require.rb>:85:in `require': cannot load such file -- date_core (LoadError)
        from <internal:/usr/lib/ruby/3.0.0/rubygems/core_ext/kernel_require.rb>:85:in `require'
        from /usr/lib/ruby/3.0.0/date.rb:4:in `<top (required)>'
        from <internal:/usr/lib/ruby/3.0.0/rubygems/core_ext/kernel_require.rb>:85:in `require'
        from <internal:/usr/lib/ruby/3.0.0/rubygems/core_ext/kernel_require.rb>:85:in `require'
        from /build/webkit2gtk/src/webkitgtk-2.38.2/Source/JavaScriptCore/generator/GeneratedFile.rb:24:in `<top (required)>'
        from /build/webkit2gtk/src/webkitgtk-2.38.2/Source/JavaScriptCore/generator/DSL.rb:25:in `require_relative'
        from /build/webkit2gtk/src/webkitgtk-2.38.2/Source/JavaScriptCore/generator/DSL.rb:25:in `<top (required)>'
        from /build/webkit2gtk/src/webkitgtk-2.38.2/Source/JavaScriptCore/generator/main.rb:24:in `require_relative'
        from /build/webkit2gtk/src/webkitgtk-2.38.2/Source/JavaScriptCore/generator/main.rb:24:in `<main>'

And ruby is currently broken..

313PackagesBug ReportMediumLow[hg] broken on i486New
0%
Task Description
Traceback (most recent call last):
  File "/usr/bin/hg", line 59, in <module>
    dispatch.run()
  File "/usr/lib/python3.10/site-packages/mercurial/dispatch.py", line 143, in run
    status = dispatch(req)
  File "/usr/lib/python3.10/site-packages/mercurial/dispatch.py", line 232, in dispatch
    status = _rundispatch(req)
  File "/usr/lib/python3.10/site-packages/mercurial/dispatch.py", line 276, in _rundispatch
    ret = _runcatch(req) or 0
  File "/usr/lib/python3.10/site-packages/mercurial/dispatch.py", line 451, in _runcatch
    return _callcatch(ui, _runcatchfunc)
  File "/usr/lib/python3.10/site-packages/mercurial/dispatch.py", line 461, in _callcatch
    return scmutil.callcatch(ui, func)
  File "/usr/lib/python3.10/site-packages/mercurial/scmutil.py", line 153, in callcatch
    return func()
  File "/usr/lib/python3.10/site-packages/mercurial/dispatch.py", line 441, in _runcatchfunc
    return _dispatch(req)

That’s why ‘nss’ is not rebuilding on i486.

319PackagesBug ReportMediumLow[js102] rebuild results in a broken JS interpreter outp...New
0%
Task Description
 2:33.16 1 warning generated.
 2:47.25     Finished release [optimized] target(s) in 2m 24s
 3:50.23 js/src/build/libjs_static.a
 3:50.23 js/src/build/libmozjs-102.so
 3:51.27 js/src/gdb/gdb-tests
 3:51.27 js/src/shell/js
 3:51.33 js/src/jsapi-tests/jsapi-tests
 3:52.83 ./spidermonkey_checks.stub
 3:54.52 TEST-PASS | check_spidermonkey_style.py | ok
 3:54.79 TEST-PASS | check_macroassembler_style.py | ok
 3:54.84 TEST-PASS | check_js_opcode.py | ok
 3:55.04 7 compiler warnings present.
 3:55.09 Overall system resources - Wall time: 233s; CPU: 0%; Read bytes: 0; Write bytes: 0; Read time: 0; Write time: 0
 3:55.13 warning: intl/icu/source/i18n/nfsubs.cpp:1313:17 [-Wunused-but-set-variable] variable 'pow' set but not used
 3:55.13 warning: intl/icu/source/i18n/ucol.cpp:108:12 [-Wdeprecated-declarations] 'ucol_safeClone_71' is deprecated
 3:55.13 warning: mfbt/tests/TestResult.cpp:101:20 [-Wdeprecated-declarations] 'is_literal_type_v<mozilla::Result<int *, Failed>>' is deprecated
 3:55.13 warning: mfbt/tests/TestResult.cpp:102:20 [-Wdeprecated-declarations] 'is_literal_type_v<mozilla::Result<mozilla::Ok, Failed>>' is deprecated
 3:55.13 warning: mfbt/tests/TestResult.cpp:103:20 [-Wdeprecated-declarations] 'is_literal_type_v<mozilla::Result<mozilla::Ok, Foo8>>' is deprecated
 3:55.13 warning: mfbt/tests/TestResult.cpp:104:20 [-Wdeprecated-declarations] 'is_literal_type_v<mozilla::Result<Foo8, Foo16>>' is deprecated
 3:55.13 warning: mfbt/tests/TestResult.cpp:105:21 [-Wdeprecated-declarations] 'is_literal_type_v<mozilla::Result<mozilla::Ok, mozilla::UniquePtr<int>>>' is deprecated
 3:55.13 Your build was successful!
 Config object not found by mach.
Configure complete!
Be sure to run |mach build| to pick up any changes
To view resource usage of the build, run |mach resource-usage|.
To take your build for a test drive, run: |mach run|
Profiling instrumented JS...
/startdir/PKGBUILD: line 154:  6398 Segmentation fault      (core dumped) "$js" run.js
320PackagesBug ReportMediumLow[btop] On i486 fails on clock_gettime64New
0%
Task Description

shows a red ERROR: on startup, strace shows:

write(2, "\n", 1
)                       = 1
clock_gettime64(CLOCK_REALTIME, {tv_sec=1675495215, tv_nsec=436798535}) = 0
exit_group(1)                           = ?
+++ exited with 1 +++
[root@eurobuild6-7-i486 ~]# btop
ERROR: No UTF-8 locale detected!
326PackagesBug ReportMediumLow[php] needs a rebuildNew
0%
Task Description

httpd/conf/httpd.conf: Cannot load modules/libphp.so into server: libssl.so.1.1>

337PackagesBug ReportMediumLowpackages are being downgraded in reposNew
0%
Task Description

warning: filesystem: local (2023.09.18-1.0) is newer than core (2023.01.31-1.0)

348PackagesBug ReportMediumLowopenssl failing testsNew
0%
Task Description
30-test_aesgcm.t ........................ ok                                                                ������������������������������������������������������������������                                                                                             

ALG_PERR: engines/e_afalg.c(463): Failed to bind socket : No such file or directory                         �����������������������������������������������������������������������������������������������������������������������������                                                                                   
        # ERROR: (bool) 'EVP_CipherInit_ex(ctx, cipher, e, key, iv, 1) == true' failed @ test/afalgtest.c   ������������������������������������������������������������������������������������������������������������������������������������������������������������c                                                                             :85                                                                                                         �����           
        # false                                                                                             �����������������������                                                        
        # 00000000:error:40000067:lib(128)::socket bind failed:engines/e_afalg.c:464:                       ������������������������������������������������������������������������������������������������������������������������������:                                                                                  
        # OPENSSL_TEST_RAND_SEED=1707239178                                                                 �����������������������������������������������������������������                                                                                             
        not ok 1 - iteration 1                                                                              ������������������������������������������ㄠ                                                                                                
# ------------------------------------------------------------------------------                            ������������������������������������������������������������������������������������������������������������������������                                                                                    
ALG_PERR: engines/e_afalg.c(463): Failed to bind socket : No such file or directory                         �����������������������������������������������������������������������������������������������������������������������������                                                                                   
        # ERROR: (bool) 'EVP_CipherInit_ex(ctx, cipher, e, key, iv, 1) == true' failed @ test/afalgtest.c   ������������������������������������������������������������������������������������������������������������������������������������������������������������c                                                                             :85                                                                                                         �����           
        # false                                                                                             �����������������������                                                        
        # 00000000:error:40000067:lib(128)::socket bind failed:engines/e_afalg.c:464:                       ������������������������������������������������������������������������������������������������������������������������������:                                                                                  
        # OPENSSL_TEST_RAND_SEED=1707239178                                                                 �����������������������������������������������������������������                                                                                             
        not ok 2 - iteration 2                                                                              ������������������������������������������㈠                                                                                                
# ------------------------------------------------------------------------------                            ������������������������������������������������������������������������������������������������������������������������                                                                                    
ALG_PERR: engines/e_afalg.c(463): Failed to bind socket : No such file or directory                         �����������������������������������������������������������������������������������������������������������������������������                                                                                   
        # ERROR: (bool) 'EVP_CipherInit_ex(ctx, cipher, e, key, iv, 1) == true' failed @ test/afalgtest.c   ������������������������������������������������������������������������������������������������������������������������������������������������������������c                                                                             :85                                                                                                         �����           
        # false                                                                                             �����������������������                                                        
        # 00000000:error:40000067:lib(128)::socket bind failed:engines/e_afalg.c:464:                       ������������������������������������������������������������������������������������������������������������������������������:                                                                                  
        # OPENSSL_TEST_RAND_SEED=1707239178                                                                 �����������������������������������������������������������������                                                                                             
        not ok 3 - iteration 3                                                                              ������������������������������������������㌠                                                                                                
# ------------------------------------------------------------------------------                            ������������������������������������������������������������������������������������������������������������������������                                                                                    
    # OPENSSL_TEST_RAND_SEED=1707239178                                                                     �����������������������������������������������������������                                                                                              
    not ok 1 - test_afalg_aes_cbc                                                                           ������������������������������������������������c                                                                                               
# ------------------------------------------------------------------------------                            ������������������������������������������������������������������������������������������������������������������������                                                                                    
../../util/wrap.pl ../../test/afalgtest => 1                                                                ������������������������������������������������������������������                                                                                             
not ok 1 - running afalgtest                                                                                ������������������������������������������                                                                                                 

349PackagesBug ReportMediumLowtop print "get_mempolicy: Function not implemented" on ...New
0%
Task Description

no task description

20Packages: Build-listBug ReportMediumLow[sagemath-doc] building documentation using Sphinx segf...New
0%
Task Description

[tutorial ] Saved pickle file: citations.pickle
[tutorial ] Exception occurred:
[tutorial ] File “/usr/lib/python2.7/site-packages/sphinx/environment/init.py”, line 152, in dump
[tutorial ] pickle.dump(env, f, pickle.HIGHEST_PROTOCOL)
[tutorial ] MemoryError
[tutorial ] The full traceback has been saved in /tmp/sphinx-err-kSNZ9A.log, if you want to report the issue to the developers.
[tutorial ] Please also report this if it was a user error, so that a better error message can be provided next time.
[tutorial ] A bug report can be filed in the tracker at . Thanks!
Build finished. The built documents can be found in /build/sagemath-doc/src/sage-8.1/src/doc/html/ja/tutorial
/startdir/PKGBUILD: line 79: 2540 Segmentation fault (core dumped) python2 sage_setup/docbuild –no-pdf-links -k all html
==&gt; ERROR: A failure occurred in build().

  Aborting...

==&gt; ERROR: Build failed, check /data/archbuild/staging-i686/copy/build

Bing Cache

28Packages: Build-listBug ReportMediumLowpostgrest: checks start a Postgresql server and then te...New
0%
Task Description

Starting check()… WARNING [pifpaf.drivers] `psutil.Popen(pid=2683, status=’terminated’)` is already gone, sending SIGKILL to its process group
WARNING [pifpaf.drivers] `psutil.Popen(pid=2671, status=’terminated’)` is already gone, sending SIGKILL to its process group
WARNING [pifpaf.drivers] `psutil.Popen(pid=2669, status=’terminated’)` is already gone, sending SIGKILL to its process group
ERROR [pifpaf] Error while running command: [b’/usr/bin/pg_ctl’, ‘-w’, ‘-o’, ‘-k /tmp/tmp5_5e9_hy -p 5432 -h “127.0.0.1”‘, ‘start’]
createdb: could not connect to database template1: could not connect to server: No such file or directory
Is the server running locally and accepting
connections on Unix domain socket “/run/postgresql/.s.PGSQL.5432”? ERROR: A failure occurred in check().
Aborting…
ERROR: Build failed, check /data/archbuild/staging-i686/arch32/build

Disabling tests for now.

  Comments (1)
  Related Tasks (0/0)

Admin
Andreas Baumann commented on 15.02.2018 16:56

Didn’t pifpaf itself had problems building? Maybe it’s a pifpaf issue..

Bing cache

68Packages: Build-listBug ReportMediumLowdmd rebuild results in gen_man segfaultNew
0%
Task Description

FS#68 : dmd rebuild results in gen_man segfault
Opened by Andreas Baumann - 01.05.2019. FS#68 - dmd rebuild results in gen_man segfault. make: Entering directory ‘/build/dmd/src/dmd/docs’ …

70Packages: Build-listBug ReportMediumLowchromium not available for i686 (fails in compiler intr...New
0%
Task Description

Attached to Project: Archlinux32
Opened by Andreas Baumann - 10.05.2019
FS#70 - chromium needs SSE2

chromium starts, but every page it loads ends in “Aw snap” and on the console:

Check failed: cpu.has_sse2().

Google Cache

63Packages: StableBug ReportMediumLownodejs crashes in libuv when cleaning up FSReqCallbackNew
0%
Task Description

Attached to Project: Archlinux32
Opened by Andreas Baumann - 07.02.2019
FS#63 - nodejs crashes in libuv when cleaning up FSReqCallback

Program terminated with signal SIGSEGV, Segmentation fault.
#0 0×00945919 in node::fs::FSReqCallback::~FSReqCallback() ()
[Current thread is 1 (Thread 0xb5614880 (LWP 2013))]
(gdb) bt
#0 0×00945919 in node::fs::FSReqCallback::~FSReqCallback() ()
#1 0×00937274 in node::fs::FSReqAfterScope::~FSReqAfterScope() ()
#2 0x0093767d in node::fs::AfterInteger(uv_fs_s*) ()
#3 0xb7e910e0 in uv.work_done () from /usr/lib/libuv.so.1
#4 0xb7e9526e in ?? () from /usr/lib/libuv.so.1
#5 0xb7ea51f8 in uv.io_poll () from /usr/lib/libuv.so.1
#6 0xb7e95c51 in uv_run () from /usr/lib/libuv.so.1
#7 0x00905d37 in node::Start(v8::Isolate*, node::IsolateData*, std::vector, std::allocator &gt;, std::allocator, std::allocator &gt; &gt; &gt; const&amp;, std::vector, std::allocator &gt;, std::allocator, std::allocator &gt; &gt; &gt; const&amp;) ()
#8 0×00903655 in node::Start(int, char**) ()
#9 0x008acef1 in main ()

This affects gyp, vault and probably some other packages, depending whether those callbacks are used or not.

  Comments (1)
  Related Tasks (0/0)

Admin
Andreas Baumann commented on 07.02.2019 09:36

See also mailing list thread:

https://lists.archlinux.org/pipermail/arch-ports/2018-November/000835.html

Google Code

82Packages: StableBug ReportMediumLow[glibc] ld warning: /usr/lib32/ld-linux.so.2: corrupt G...New
0%
Task Description

Attached to Project: Archlinux32
Opened by Jeff Hodd - 11.07.2019
Last edited by Andreas Baumann - 09.08.2019
FS#82 - [glibc] ld warning: /usr/lib32/ld-linux.so.2: corrupt GNU_PROPERTY_TYPE (5) size: 0

All software builds are producing this warning. Some builds are failing because of the error return on linking. I’m also seeing failures on LD_PRELOADs.

/bin/ld: warning: /usr/lib/ld-linux.so.2: corrupt GNU_PROPERTY_TYPE (5) size: 0

Easy to reproduce. Just build this program:

# test.c
# Compiled with ‘gcc test.c’ int main() {

  return 0;

}

This was reported at bugs.archlinux.org (reference https://bugs.archlinux.org/task/63015) where it was closed and considered fixed if built using the –enable-cet flag. I built glibc with the –enable-cet flag, but am still seeing the failures, so not fixed.
Closed by Andreas Baumann
09.08.2019 11:44
Reason for closing: Fixed

  Comments (6)
  Related Tasks (0/0)

Jeff Hodd commented on 16.07.2019 03:29

I’ve narrowed down the glibc upgrade to glibc-2.29-1.26 -&gt; glibc-2.29-1.27. The error doesn’t occur with glibc-2.29-1.26. There were 3 changes made to the arch32 PKGBUILD for the glibc-2.29-1.27 release. One of them caused this issue.
Admin
Andreas Baumann commented on 16.07.2019 05:33

There is another thing which can change: the toolchain.
This GNU_PROPERTY error is something the compiler emits (we think it’s CET stuff, but it’s badly
documented). Binutils ld seems not to like this ELF section.

The error is the same as in:

https://bugs.archlinux.org/task/63015

What’s puzzling me: –enable-cet is there in glibc, gcc, binutils (just not for i486, as CET doesn’t\
work for older CPUs).

Commit: 09d03cbd4c57b8eabfadd22b67929d958b2409d7 and d57a456faa674c24e8869a26a14c497c95accf1f in
glibc are mine, they try to change stack alignment and handling of SSE for pentium4 for Java, also without effect.
Admin
Andreas Baumann commented on 16.07.2019 05:35

About linker warnings being turned to errors (as for compiler warnings turned to errors): this
is something the DEVELOPER should do, NOT the PACKAGER. Released software should:
- NOT include asserts
- NOT include debug code
- NOT include code only used for running tests
- NOT use -Werror
- NOT use -Wl,–fatal-warnings

See for instance extra-cmake-modules-5.59.0-ld-no-fatal-warning.patch.
Jeff Hodd commented on 16.07.2019 21:50

I knew about the cet issue. Did quite abit of looking around to get some insight into it (even looked at the code - elf-properties.c - and it looks like the Elf_Internal_Note description size is coming back with a value of 0. the other possibility is that (size % 4) is something other than 0 which is less likely). From what i could gather, cet is supposed to be enabled in the latest builds of glibc for i686 even though, as you pointed out, it’s not well documented. I did do a 2.29-4 i686 build with cet enabled and it made no difference vis-a-vis the warning. I also checked the upstream diff between 2.29-1.26 and 2.29-1.27 and noticed the addition of –enable-static-pie and thought maybe position independent executables may explain it. Did another glibc build with static pie disabled and that made no difference. Am about to go back and check the diff again and see what else may have changed.

I did check the CMakeLists.txt file for my failing build and it uses -Werror and -Wl,–fatal-warnings so I will remove those. But that doesn;t actually fix the underlying issue of the warning which we shouldn;t be seeing.

It is up to the developer, but too often one has to show that a change fixes an issue before you’ll get any attention. I may not be THE developer for this particular package, but I am A developer (in general), so I don;t feel uncomfortable making code changes.

I’ll keep looking around for differences between the 1.26 and 1.27 builds.
Jeff Hodd commented on 16.07.2019 22:15

if (note-&gt;descsz &lt; 8 || (note-&gt;descsz % align_size) != 0)

  {

bad_size:

    _bfd_error_handler
(_("warning: %pB: corrupt GNU_PROPERTY_TYPE (%ld) size: %#lx"),
 abfd, note-&gt;type, note-&gt;descsz);
    return FALSE;
  }

The warning is printing out the description size - and that’s 0.

Apparently it’s supposed to be &gt;= 8 and divisible by 4:

unsigned int align_size = bed-&gt;s-&gt;elfclass == ELFCLASS64 ? 8 : 4;

I am assuming that arch32 doesn’t support ELFCLASS64.
Jeff Hodd commented on 22.07.2019 17:13

https://bbs.archlinux32.org/viewtopic.php?id=2770

Google Cache

103Packages: StableBug ReportMediumLowyarn segfaultsNew
0%
Task Description

experienced when building buildbot-www

/bin/sh: line 1: 4744 Segmentation fault (core dumped) yarn install –pure-lockfile

322Packages: StableBug ReportVery LowMediumfile header absentNew
0%
Task Description

on fresh install file /usr/lib/libbfd.so lacks header “/* GNU ld script */” so I see complains on terminal

351Packages: StableBug ReportVery LowMediumVarious python-X packages building for Python 3.10 and ...New
0%
Task Description

yes, confirmed, that’s because python 3.11 is the only package building and being
published to stable, the python modules need bootstrapping (since months).

36Packages: TestingBug ReportMediumLowtexlive-core: SSE2 requiredNew
0%
Task Description

Attached to Project: Archlinux32
Opened by Andreas Baumann - 14.04.2018
Last edited by Andreas Baumann - 16.04.2018
FS#36 - texlive-core: SSE2 required

(4/5) Updating TeXLive format files… PANIC: unprotected error in call to Lua API (CPU with SSE2 required)
fmtutil [ERROR]: running `luajittex -ini -jobname=luajittex -progname=luajittex luatex.ini /null’ return status 1
fmtutil [ERROR]: return error due to options –strict
error: command failed to execute correctly
(5/5) Updating TeXLive font maps…

So, the problem seems to be in lua itself?

Bing Cache

283PackagesBug ReportVery LowLow[icu70/icu71 ] packages not rebuilt yetAssigned
0%
Task Description

starting to collect them here packages which require icu69 (and have thus not been rebuilt
for icu 71 yet):

libreoffice-fresh

287PackagesFeature RequestVery LowLowchromium not able to buildAssigned
0%
Task Description

Wait unfortunately i found a patch through which chromium would compile on x86

please try to build chromium using those patches

https://github.com/void-linux/void-packages/blob/master/srcpkgs/chromium/patches/reenable-linux-i686-builds.patch https://github.com/void-linux/void-packages/blob/master/srcpkgs/chromium/patches/chromium-i686-vaapi-fpermissive.patch https://github.com/void-linux/void-packages/blob/master/srcpkgs/chromium/patches/chromium-105-bitmap-include.patch https://github.com/void-linux/void-packages/blob/master/srcpkgs/chromium/patches/chromium-105-browser-include.patch

294PackagesBug ReportVery LowHigh[qtile] importlib.metadata.PackageNotFoundError: No pac...Assigned
0%
Task Description

When running qtile I get the following error message:

[qtile] importlib.metadata.PackageNotFoundError: No package metadata was found for qtile

Running qtile on Arch Linux works as expected.

$ qtile start
Traceback (most recent call last):
  File "/usr/bin/qtile", line 33, in <module>
    sys.exit(load_entry_point('qtile==0.18.1', 'console_scripts', 'qtile')())
  File "/usr/bin/qtile", line 22, in importlib_load_entry_point
    for entry_point in distribution(dist_name).entry_points
  File "/usr/lib/python3.10/importlib/metadata/__init__.py", line 957, in distribution
    return Distribution.from_name(distribution_name)
  File "/usr/lib/python3.10/importlib/metadata/__init__.py", line 548, in from_name
    raise PackageNotFoundError(name)
importlib.metadata.PackageNotFoundError: No package metadata was found for qtile
$ pacman -Qi qtile
Name            : qtile
Version         : 0.18.1-3.0
Description     : A full-featured, pure-Python tiling window manager
Architecture    : pentium4
URL             : http://www.qtile.org
Licenses        : MIT
Groups          : None
Provides        : None
Depends On      : gdk-pixbuf2  glibc  libnotify  librsvg  pango  python-cairocffi  python-cffi  python-xcffib  python-gobject  python-setuptools
Optional Deps   : alsa-utils: for volume widget
                  canto-daemon: for canto widget
                  cmus: for cmus widget
                  jupyter_console: for interaction with qtile via Jupyter
                  khal: for khal_calendar widget
                  libpulse: for pulse_volume and pulseaudio_ffi widget [installed]
                  lm_sensors: for sensors widget [installed]
                  moc: for moc widget
                  python-dbus-next: for utils, notifications and several widgets
                  python-iwlib: for wlan widget
                  python-keyring: for imapwidget widget
                  python-mpd2: mpd2widget widget
                  python-psutil: graph, net and memory widget [installed]
                  python-pywlroots: for experimental wayland support
                  python-setproctitle: change process name to qtile
                  python-xdg: launchbar widget
Required By     : None
Optional For    : None
Conflicts With  : None
Replaces        : None
Installed Size  : 3.25 MiB
Packager        : Andreas Baumann <mail@andreasbaumann.cc>
Build Date      : Mon 04 Oct 2021 12:02:58
Install Date    : Mon 26 Sep 2022 13:33:45
Install Reason  : Explicitly installed
Install Script  : Yes
Validated By    : Signature
$ sudo pacman -Syu
:: Synchronizing package databases...
 core downloading...
 extra downloading...
 community downloading...
:: Starting full system upgrade...
 there is nothing to do
311PackagesBug ReportMediumLow[ffmpeg] fails with SIGILL on i686Assigned
0%
Task Description

work fine on pentium4

reproducable: ffplay <file.mp4>

offending opcode:

 0xb5f315e7:  f3 0f 10 83 d0 0b 00 00 movss  
                  0xbd0(%ebx),%xmm0
321PackagesBug ReportMediumLow[gnome] brokenAssigned
0%
Task Description

mutter had a checksum issue (trivial).

gnome-shell misses a current version of gjs:

Dependency gjs-1.0 found: NO found 1.70.2 but need: '>= 1.73.1'
Did not find CMake 'cmake'
Found CMake: NO
Run-time dependency gjs-1.0 found: NO 

gnome-shell/meson.build:80:0: ERROR: Dependency lookup for gjs-1.0 with method 'pkgconfig' failed: Invalid version, need 'gjs-1.0' ['>= 1.73.1'] found '1.70.2'.

A full log can be found at /build/gnome-shell/src/build/meson-logs/meson-log.txt
333PackagesBug ReportVery LowHighSddm 0.19.0-9.0 crashes with Qt 5.15.9Assigned
0%
Task Description

The current version of sddm (0.19.0-9.0) depends on the previous version of Qt (5.15.8). After updating Qt, sddm crashes with an incompatible Qt library error.

Showing tasks 51 - 74 of 74 Page 2 of 2 - 1 - 2

Available keyboard shortcuts

Tasklist

Task Details

Task Editing