Bugs in Archlinux32 packages, specific to 32-bit issues.

Bugs  FS#2  to  FS#92  have been recovered and may be incomplete, the
recovered Google/Bing cache data can be found here.

IDCategoryTask TypePrioritySeverity  descSummaryStatusProgress
163PackagesBug ReportMediumLowsphinx_rtd_theme is used to build documentation but doe...New
0%
Task Description
build
running build_py
npm WARN npm npm does not support Node.js v15.9.0
npm WARN npm You should probably upgrade to a newer version of node as we
npm WARN npm can't make any promises that npm will work with this version.
npm WARN npm Supported releases of Node.js are the latest release of 6, 8, 9, 10, 11, 12, 13.
npm WARN npm You can find the latest version at https://nodejs.org/

> sphinx_rtd_theme@0.5.1 preinstall /build/python-sphinx_rtd_theme/src/sphinx_rtd_theme-0.5.1
> bin/preinstall.js

Traceback (most recent call last):
  File "/build/python-sphinx_rtd_theme/src/sphinx_rtd_theme-0.5.1/setup.py", line 86, in <module>
    setup(
  File "/usr/lib/python3.9/site-packages/setuptools/__init__.py", line 153, in setup
    return distutils.core.setup(**attrs)
  File "/usr/lib/python3.9/distutils/core.py", line 148, in setup
    dist.run_commands()
  File "/usr/lib/python3.9/distutils/dist.py", line 966, in run_commands
    self.run_command(cmd)
  File "/usr/lib/python3.9/distutils/dist.py", line 985, in run_command
    cmd_obj.run()
  File "/usr/lib/python3.9/distutils/command/build.py", line 135, in run
    self.run_command(cmd_name)
  File "/usr/lib/python3.9/distutils/cmd.py", line 313, in run_command
    self.distribution.run_command(command)
  File "/usr/lib/python3.9/distutils/dist.py", line 985, in run_command
    cmd_obj.run()
  File "/build/python-sphinx_rtd_theme/src/sphinx_rtd_theme-0.5.1/setup.py", line 22, in run
    subprocess.run(['npm', 'install'], check=True)
  File "/usr/lib/python3.9/subprocess.py", line 524, in run
    raise CalledProcessError(retcode, process.args,
subprocess.CalledProcessError: Command '['npm', 'install']' died with <Signals.SIGSEGV: 11>.
==> ERROR: A failure occurred in build().
    Aborting...
==> ERROR: Build failed, check /var/lib/archbuild/staging-pentium4/abaumann/build
162PackagesBug ReportMediumLowbrowsers based on Chromium break in secomp sanboxingNew
0%
Task Description

Everything using chromium/seccomp jailing breaks currently including chromium due to missing IA-32
rules in libseccomp and/or chromium itself.

Firefox seems to work fine.
epiphany works.
midori works.
luakit works.

Chromium crashes with sigsegv (I would expect something which reminds me of a seccomp syscall?).

konqueror, falkon, qutebrowser are based on qt5-webengine. They all open up but then don’t render a page (issuing the seccomp error messages attached below).

vivaldi the same, but as it is closed source, we cannot fix it.

143PackagesBug ReportMediumLowthunderbird doesn't build and runNew
0%
Task Description

still linked against icu67.

Same here, I cannot believe that somebody is actually using thunderbird on Archlinux32 anymore.

Triggered rebuild, doesn’t build currently.

141DevopsBug ReportMediumLowmake iso build more reliablyNew
0%
Task Description

Currently, the iso build are several bash scripts on several machines requiring to move stuff via sshfs and alike.

This should become more stable - ideally some single script/package/systemd-unit with proper error reporting (email or irc come to my mind)

132PackagesBug ReportMediumLowOLPC-XO-1 kernel, usb8xx module crashingNew
0%
Task Description
[   21.686772] usb8xxx: Firmware ready event received
[   21.717061] usb8xxx 1-1:1.0 (unnamed net_device) (uninitialized): 00:17:c4:10:e3:67, fw 5.110.22p23, cap 0x000003a3
[   21.897489] usb8xxx 1-1:1.0 wlan0: Marvell WLAN 802.11 adapter
[   22.004871] usb8xxx 1-1:1.0 wlan0: PREP_CMD: command 0x0074 failed: 2
[   22.109002] usb8xxx 1-1:1.0 wlan0: Firmware does not seem to support PS mode
[   22.217405] usb8xxx 1-1:1.0 wlan0: PREP_CMD: command 0x0043 failed: 1
[   22.318862] usb8xxx 1-1:1.0 wlan0: HOST_SLEEP_CFG failed 1
[   23.468484] usb8xxx 1-1:1.0 wlp0s15f5u1: renamed from msh0
[   43.523176] ------------[ cut here ]------------
[   43.556197] WARNING: CPU: 0 PID: 148 at net/wireless/core.c:1346 cfg80211_netdev_notifier_call+0x102/0x31e
[   43.625361] Modules linked in: input_leds led_class usb8xxx libertas serio_raw
[   43.664224] CPU: 0 PID: 148 Comm: wpa_supplicant Not tainted 5.10.5-arch1-1.0-olpc-xo1 #1
[   43.715531] Hardware name: OLPC XO/XO, BIOS OLPC Ver 1.00.01 06/11/2014
[   43.754829] EIP: cfg80211_netdev_notifier_call+0x102/0x31e
[   43.792862] Code: ff 89 f0 e8 4d fc ff ff 8b 46 7c 85 c0 74 2a 39 58 34 75 25 80 78 64 00 75 16 8b 96 80 00 00 00 85 d2 74 06 80 7a 64 00 75 06 <0f> 0b c6 40 62 01 31 d2 89 f0 e8 3d 7a 00 00 8b 86 88 00 00 00 8b
[   43.911511] EAX: c36e1d00 EBX: c2cb8800 ECX: ffffffff EDX: 00000000
[   43.958939] ESI: c341c000 EDI: c1f7d000 EBP: c1eebdd4 ESP: c1eebdbc
[   44.002464] DS: 007b ES: 007b FS: 0000 GS: 00e0 SS: 0068 EFLAGS: 00010246
[   44.045454] CR0: 80050033 CR2: b69e5428 CR3: 01ff0000 CR4: 00000090
[   44.088019] Call Trace:
[   44.126010]  ? fib_disable_ip+0x2a/0x2d
[   44.165297]  ? cfg80211_register_wdev+0x46/0x46
[   44.208941]  notifier_call_chain+0x2a/0x4e
[   44.252482]  raw_notifier_call_chain+0xc/0xe
[   44.296501]  call_netdevice_notifiers_info+0x5d/0x64
[   44.338599]  call_netdevice_notifiers+0x18/0x1a
[   44.379580]  __dev_notify_flags+0x4a/0x7c
[   44.419064]  dev_change_flags+0x3d/0x46
[   44.464304]  devinet_ioctl+0x260/0x4cd
[   44.502437]  inet_ioctl+0x139/0x163
[   44.539766]  ? dev_name_hash+0x20/0x36
[   44.577060]  ? dev_get_by_name_rcu+0x1c/0x2f
[   44.614874]  ? dev_ioctl+0x2e4/0x40e
[   44.651928]  ? inet_recvmsg+0x77/0x77
[   44.692778]  sock_ioctl+0x2ad/0x36f
[   44.730157]  ? preempt_count_add+0x4a/0x4f
[   44.771397]  ? ____sys_recvmsg+0xbc/0xbc
[   44.808485]  vfs_ioctl+0x1a/0x24
[   44.847256]  __ia32_sys_ioctl+0x5aa/0x5c4
[   44.891962]  ? debug_smp_processor_id+0x12/0x14
[   44.930996]  ? fpregs_assert_state_consistent+0x17/0x34
[   44.967562]  ? exit_to_user_mode_prepare+0x84/0x94
[   45.002448]  do_int80_syscall_32+0x2c/0x39
[   45.035656]  entry_INT80_32+0xf3/0xf3
[   45.067762] EIP: 0xb790ffc4
[   45.097915] Code: 83 c4 0c 89 d8 5b 5e 5f 5d c3 66 90 66 90 66 90 66 90 66 90 66 90 53 8b 54 24 10 8b 4c 24 0c 8b 5c 24 08 b8 36 00 00 00 cd 80 <5b> 3d 01 f0 ff ff 0f 83 a0 3f f3 ff c3 66 90 66 90 66 90 66 90 66
[   45.199342] EAX: ffffffda EBX: 00000007 ECX: 00008914 EDX: bffe736c
[   45.233187] ESI: bffe736c EDI: 0076c850 EBP: 00000000 ESP: bffe7348
[   45.266705] DS: 007b ES: 007b FS: 0000 GS: 0033 SS: 007b EFLAGS: 00000296
[   45.300799] ---[ end trace 20811b76aa348f84 ]---
[   64.909322] IPv6: ADDRCONF(NETDEV_CHANGE): wlp0s15f5u1: link becomes ready

Warm reboot a second time seems to help.

126PackagesBug ReportMediumLowlua hooks break in TeX on i686New
0%
Task Description
PANIC: unprotected error in call to Lua API (CPU with SSE2 required)
PANIC: unprotected error in call to Lua API (CPU with SSE2 required)
fmtutil [ERROR]: running `luajittex -ini   -jobname=luajittex -progname=luajittex luatex.ini </dev/null' return status: 1
fmtutil [ERROR]: cannot copy log luajittex.log to: /var/lib/texmf/web2c/luajittex
fmtutil [ERROR]: returning error due to option --strict
fmtutil [ERROR]: running `luajithbtex -ini   -jobname=luajithbtex -progname=luajithbtex luatex.ini </dev/null' return status: 1
fmtutil [ERROR]: cannot copy log luajithbtex.log to: /var/lib/texmf/web2c/luajithbtex
fmtutil [ERROR]: returning error due to option --strict
error: command failed to execute correctly
117PackagesBug ReportVery LowLowvboxdrive module missingNew
0%
Task Description

vboxdrv module is missing making virtualbox unusable.

I’m currently running kernel 5.9.0-1.0-pae but it doesn’t seem to be there in any version

116PackagesBug ReportMediumLowRace causes iptables not to be ready after startupNew
0%
Task Description

Nov 06 08:04:01 eurohp1 systemd[1]: Starting IPv4 Packet Filtering Framework… Nov 06 08:04:01 eurohp1 iptables-restore[287]: Another app is currently holding the xtables lock. Perhap>
Nov 06 08:04:01 eurohp1 systemd[1]: iptables.service: Main process exited, code=exited, status=4/NOPERMI>
Nov 06 08:04:01 eurohp1 systemd[1]: iptables.service: Failed with result ‘exit-code’.
Nov 06 08:04:01 eurohp1 systemd[1]: Failed to start IPv4 Packet Filtering Framework.

Works when starting iptables later manually.

This is security relevant as not having a firewall after startup puts the system at risk.

109PackagesBug ReportMediumLowgcc10 -fno-common breaks jdkNew
0%
Task Description

/usr/bin/ld: /build/java-openjdk/src/jdk14u-jdk-14.0.1+7/build/linux-x86-server-release/support/native/java.base/libjava/childproc.o:/build/java-openjdk/src/jdk14u-jdk-14.0.1+7/src/java.base/unix/native/libjava/childproc.h:129: multiple definition of `parentPathv’; /build/java-openjdk/src/jdk14u-jdk-14.0.1+7/build/linux-x86-server-release/support/native/java.base/libjava/ProcessImpl_md.o:/build/java-openjdk/src/jdk14u-jdk-14.0.1+7/src/java.base/unix/native/libjava/childproc.h:129: first defined here

collect2: error: ld returned 1 exit status

This is fixed known and fixed upstream (without just setting
-fcommon again):

https://bugs.openjdk.java.net/browse/JDK-8235903

103Packages: StableBug ReportMediumLowyarn segfaultsNew
0%
Task Description

experienced when building buildbot-www

/bin/sh: line 1: 4744 Segmentation fault (core dumped) yarn install –pure-lockfile

100Packages: StableBug ReportVery LowLowmldonkey crashesUnconfirmed
0%
Task Description

All versions of mldonkey crash in arch32 updated. (segmentation fault and core dumped)

82Packages: StableBug ReportMediumLow[glibc] ld warning: /usr/lib32/ld-linux.so.2: corrupt G...New
0%
Task Description

Attached to Project: Archlinux32
Opened by Jeff Hodd - 11.07.2019
Last edited by Andreas Baumann - 09.08.2019
FS#82 - [glibc] ld warning: /usr/lib32/ld-linux.so.2: corrupt GNU_PROPERTY_TYPE (5) size: 0

All software builds are producing this warning. Some builds are failing because of the error return on linking. I’m also seeing failures on LD_PRELOADs.

/bin/ld: warning: /usr/lib/ld-linux.so.2: corrupt GNU_PROPERTY_TYPE (5) size: 0

Easy to reproduce. Just build this program:

# test.c
# Compiled with ‘gcc test.c’ int main() {

  return 0;

}

This was reported at bugs.archlinux.org (reference https://bugs.archlinux.org/task/63015) where it was closed and considered fixed if built using the –enable-cet flag. I built glibc with the –enable-cet flag, but am still seeing the failures, so not fixed.
Closed by Andreas Baumann
09.08.2019 11:44
Reason for closing: Fixed

  Comments (6)
  Related Tasks (0/0)

Jeff Hodd commented on 16.07.2019 03:29

I’ve narrowed down the glibc upgrade to glibc-2.29-1.26 -&gt; glibc-2.29-1.27. The error doesn’t occur with glibc-2.29-1.26. There were 3 changes made to the arch32 PKGBUILD for the glibc-2.29-1.27 release. One of them caused this issue.
Admin
Andreas Baumann commented on 16.07.2019 05:33

There is another thing which can change: the toolchain.
This GNU_PROPERTY error is something the compiler emits (we think it’s CET stuff, but it’s badly
documented). Binutils ld seems not to like this ELF section.

The error is the same as in:

https://bugs.archlinux.org/task/63015

What’s puzzling me: –enable-cet is there in glibc, gcc, binutils (just not for i486, as CET doesn’t\
work for older CPUs).

Commit: 09d03cbd4c57b8eabfadd22b67929d958b2409d7 and d57a456faa674c24e8869a26a14c497c95accf1f in
glibc are mine, they try to change stack alignment and handling of SSE for pentium4 for Java, also without effect.
Admin
Andreas Baumann commented on 16.07.2019 05:35

About linker warnings being turned to errors (as for compiler warnings turned to errors): this
is something the DEVELOPER should do, NOT the PACKAGER. Released software should:
- NOT include asserts
- NOT include debug code
- NOT include code only used for running tests
- NOT use -Werror
- NOT use -Wl,–fatal-warnings

See for instance extra-cmake-modules-5.59.0-ld-no-fatal-warning.patch.
Jeff Hodd commented on 16.07.2019 21:50

I knew about the cet issue. Did quite abit of looking around to get some insight into it (even looked at the code - elf-properties.c - and it looks like the Elf_Internal_Note description size is coming back with a value of 0. the other possibility is that (size % 4) is something other than 0 which is less likely). From what i could gather, cet is supposed to be enabled in the latest builds of glibc for i686 even though, as you pointed out, it’s not well documented. I did do a 2.29-4 i686 build with cet enabled and it made no difference vis-a-vis the warning. I also checked the upstream diff between 2.29-1.26 and 2.29-1.27 and noticed the addition of –enable-static-pie and thought maybe position independent executables may explain it. Did another glibc build with static pie disabled and that made no difference. Am about to go back and check the diff again and see what else may have changed.

I did check the CMakeLists.txt file for my failing build and it uses -Werror and -Wl,–fatal-warnings so I will remove those. But that doesn;t actually fix the underlying issue of the warning which we shouldn;t be seeing.

It is up to the developer, but too often one has to show that a change fixes an issue before you’ll get any attention. I may not be THE developer for this particular package, but I am A developer (in general), so I don;t feel uncomfortable making code changes.

I’ll keep looking around for differences between the 1.26 and 1.27 builds.
Jeff Hodd commented on 16.07.2019 22:15

if (note-&gt;descsz &lt; 8 || (note-&gt;descsz % align_size) != 0)

  {

bad_size:

    _bfd_error_handler
(_("warning: %pB: corrupt GNU_PROPERTY_TYPE (%ld) size: %#lx"),
 abfd, note-&gt;type, note-&gt;descsz);
    return FALSE;
  }

The warning is printing out the description size - and that’s 0.

Apparently it’s supposed to be &gt;= 8 and divisible by 4:

unsigned int align_size = bed-&gt;s-&gt;elfclass == ELFCLASS64 ? 8 : 4;

I am assuming that arch32 doesn’t support ELFCLASS64.
Jeff Hodd commented on 22.07.2019 17:13

https://bbs.archlinux32.org/viewtopic.php?id=2770

Google Cache

70Packages: Build-listBug ReportMediumLowchromium not available for i686 (fails in compiler intr...New
0%
Task Description

Attached to Project: Archlinux32
Opened by Andreas Baumann - 10.05.2019
FS#70 - chromium needs SSE2

chromium starts, but every page it loads ends in “Aw snap” and on the console:

Check failed: cpu.has_sse2().

Google Cache

68Packages: Build-listBug ReportMediumLowdmd rebuild results in gen_man segfaultNew
0%
Task Description

FS#68 : dmd rebuild results in gen_man segfault
Opened by Andreas Baumann - 01.05.2019. FS#68 - dmd rebuild results in gen_man segfault. make: Entering directory ‘/build/dmd/src/dmd/docs’ …

63Packages: StableBug ReportMediumLownodejs crashes in libuv when cleaning up FSReqCallbackNew
0%
Task Description

Attached to Project: Archlinux32
Opened by Andreas Baumann - 07.02.2019
FS#63 - nodejs crashes in libuv when cleaning up FSReqCallback

Program terminated with signal SIGSEGV, Segmentation fault.
#0 0×00945919 in node::fs::FSReqCallback::~FSReqCallback() ()
[Current thread is 1 (Thread 0xb5614880 (LWP 2013))]
(gdb) bt
#0 0×00945919 in node::fs::FSReqCallback::~FSReqCallback() ()
#1 0×00937274 in node::fs::FSReqAfterScope::~FSReqAfterScope() ()
#2 0x0093767d in node::fs::AfterInteger(uv_fs_s*) ()
#3 0xb7e910e0 in uv.work_done () from /usr/lib/libuv.so.1
#4 0xb7e9526e in ?? () from /usr/lib/libuv.so.1
#5 0xb7ea51f8 in uv.io_poll () from /usr/lib/libuv.so.1
#6 0xb7e95c51 in uv_run () from /usr/lib/libuv.so.1
#7 0x00905d37 in node::Start(v8::Isolate*, node::IsolateData*, std::vector, std::allocator &gt;, std::allocator, std::allocator &gt; &gt; &gt; const&amp;, std::vector, std::allocator &gt;, std::allocator, std::allocator &gt; &gt; &gt; const&amp;) ()
#8 0×00903655 in node::Start(int, char**) ()
#9 0x008acef1 in main ()

This affects gyp, vault and probably some other packages, depending whether those callbacks are used or not.

  Comments (1)
  Related Tasks (0/0)

Admin
Andreas Baumann commented on 07.02.2019 09:36

See also mailing list thread:

https://lists.archlinux.org/pipermail/arch-ports/2018-November/000835.html

Google Code

36Packages: TestingBug ReportMediumLowtexlive-core: SSE2 requiredNew
0%
Task Description

Attached to Project: Archlinux32
Opened by Andreas Baumann - 14.04.2018
Last edited by Andreas Baumann - 16.04.2018
FS#36 - texlive-core: SSE2 required

(4/5) Updating TeXLive format files… PANIC: unprotected error in call to Lua API (CPU with SSE2 required)
fmtutil [ERROR]: running `luajittex -ini -jobname=luajittex -progname=luajittex luatex.ini /null’ return status 1
fmtutil [ERROR]: return error due to options –strict
error: command failed to execute correctly
(5/5) Updating TeXLive font maps…

So, the problem seems to be in lua itself?

Bing Cache

28Packages: Build-listBug ReportMediumLowpostgrest: checks start a Postgresql server and then te...New
0%
Task Description

Starting check()… WARNING [pifpaf.drivers] `psutil.Popen(pid=2683, status=’terminated’)` is already gone, sending SIGKILL to its process group
WARNING [pifpaf.drivers] `psutil.Popen(pid=2671, status=’terminated’)` is already gone, sending SIGKILL to its process group
WARNING [pifpaf.drivers] `psutil.Popen(pid=2669, status=’terminated’)` is already gone, sending SIGKILL to its process group
ERROR [pifpaf] Error while running command: [b’/usr/bin/pg_ctl’, ‘-w’, ‘-o’, ‘-k /tmp/tmp5_5e9_hy -p 5432 -h “127.0.0.1”‘, ‘start’]
createdb: could not connect to database template1: could not connect to server: No such file or directory
Is the server running locally and accepting
connections on Unix domain socket “/run/postgresql/.s.PGSQL.5432”? ERROR: A failure occurred in check().
Aborting…
ERROR: Build failed, check /data/archbuild/staging-i686/arch32/build

Disabling tests for now.

  Comments (1)
  Related Tasks (0/0)

Admin
Andreas Baumann commented on 15.02.2018 16:56

Didn’t pifpaf itself had problems building? Maybe it’s a pifpaf issue..

Bing cache

20Packages: Build-listBug ReportMediumLow[sagemath-doc] building documentation using Sphinx segf...New
0%
Task Description

[tutorial ] Saved pickle file: citations.pickle
[tutorial ] Exception occurred:
[tutorial ] File “/usr/lib/python2.7/site-packages/sphinx/environment/init.py”, line 152, in dump
[tutorial ] pickle.dump(env, f, pickle.HIGHEST_PROTOCOL)
[tutorial ] MemoryError
[tutorial ] The full traceback has been saved in /tmp/sphinx-err-kSNZ9A.log, if you want to report the issue to the developers.
[tutorial ] Please also report this if it was a user error, so that a better error message can be provided next time.
[tutorial ] A bug report can be filed in the tracker at . Thanks!
Build finished. The built documents can be found in /build/sagemath-doc/src/sage-8.1/src/doc/html/ja/tutorial
/startdir/PKGBUILD: line 79: 2540 Segmentation fault (core dumped) python2 sage_setup/docbuild –no-pdf-links -k all html
==&gt; ERROR: A failure occurred in build().

  Aborting...

==&gt; ERROR: Build failed, check /data/archbuild/staging-i686/copy/build

Bing Cache

342PackagesBug ReportVery LowVery Lownmap missing dependency openssl-1.1Unconfirmed
0%
Task Description

no task description

Showing tasks 51 - 69 of 69 Page 2 of 2 - 1 - 2

Available keyboard shortcuts

Tasklist

Task Details

Task Editing