IDCategoryTask TypePrioritySeveritySummaryStatus  descProgress
37Release EngineeringBug ReportMediumMediumISO 2018.05.01 is not bootable with qemu or VirtualboxResearching
0%
Task Description

I tried the i686 image. Booting leads to kernel panic.
Adding an explicit init=/lib/systemd/systemd parameter also panics.

qemu-system-i386 -cdrom archlinux-2018.05.01-i686.iso

It also panics in Virtualbox.

The same ISO works with libvirtd though.

12Packages: Build-listBug ReportMediumLow[python-setuptools] check() fails (due to some mpmath i...New
0%
Task Description

during check():
_ sympy/polys/tests/test_rootoftools.py:test_CRootOf_evalf _

File "/build/python-sympy/src/sympy-sympy-1.1.1-py2/sympy/polys/tests/test_rootoftools.py", line 225, in test_CRootOf_evalf
  a, b = rootof(eq, 1).n(2).as_real_imag()
File "sympy/core/evalf.py", line 1394, in evalf
  result = evalf(self, prec + 4, options)
File "sympy/core/evalf.py", line 1292, in evalf
  xe = x._eval_evalf(prec)
File "sympy/polys/rootoftools.py", line 644, in _eval_evalf
  x0 = mpc(*map(str, interval.center))
File "/usr/lib/python2.7/site-packages/mpmath/ctx_mp_python.py", line 374, in __new__
  imag = cls.context.mpf(imag)
File "/usr/lib/python2.7/site-packages/mpmath/ctx_mp_python.py", line 77, in __new__
  v._mpf_ = mpf_pos(cls.mpf_convert_arg(val, prec, rounding), prec, rounding)
File "/usr/lib/python2.7/site-packages/mpmath/ctx_mp_python.py", line 84, in mpf_convert_arg
  if isinstance(x, basestring): return from_str(x, prec, rounding)
File "/usr/lib/python2.7/site-packages/mpmath/libmp/libmpf.py", line 1300, in from_str
  return from_rational(int(p), int(q), prec, rnd)

ValueError: invalid literal for int() with base 10: ‘-2163048125L’

tests finished: 6841 passed, 185 skipped, 1 exceptions, in 4352.49 seconds

DO *NOT* COMMIT!

test process starts

executable: /usr/bin/python2 (2.7.14-final-0) [CPython]
architecture: 32-bit
cache: yes
ground types: gmpy 2.0.8
hash randomization: on (PYTHONHASHSEED=3003103148)

17Packages: Build-listBug ReportMediumLownvidia and nvidia-lts kernel module build failure on 32...New
0%
Task Description
In file included from ./arch/x86/include/asm/page.h:75:0,
                 from ./arch/x86/include/asm/thread_info.h:11,
                 from ./include/linux/thread_info.h:37,
                 from ./arch/x86/include/asm/preempt.h:6,
                 from ./include/linux/preempt.h:80,
                 from ./include/linux/spinlock.h:50,
                 from /build/nvidia/src/NVIDIA-Linux-x86-387.34/kernel/common/inc/nv-lock.h:16,
                 from /build/nvidia/src/NVIDIA-Linux-x86-387.34/kernel/common/inc/nv-linux.h:19,
                 from /build/nvidia/src/NVIDIA-Linux-x86-387.34/kernel/nvidia/os-interface.c:15:
/build/nvidia/src/NVIDIA-Linux-x86-387.34/kernel/nvidia/os-interface.c: In function 
os_unmap_kernel_numa
/build/nvidia/src/NVIDIA-Linux-x86-387.34/kernel/nvidia/os-interface.c:824:15: warning: cast from pointer to integer of different size [-Wpointer-to-int-cast]
     NV_KUNMAP((NvU64)addr);
               ^
./include/asm-generic/memory_model.h:32:41: note: in definition of macro 
__pfn_to_page
 #define __pfn_to_page(pfn) (mem_map + ((pfn) - ARCH_PFN_OFFSET))
                                         ^~~
./arch/x86/include/asm/page_32.h:12:25: note: in expansion of macro 
__phys_addr_nodebug
 #define __phys_addr(x)  __phys_addr_nodebug(x)
                         ^~~~~~~~~~~~~~~~~~~
./arch/x86/include/asm/page.h:41:18: note: in expansion of macro 
__phys_addr
 #define __pa(x)  __phys_addr((unsigned long)(x))
                  ^~~~~~~~~~~
./arch/x86/include/asm/page.h:68:41: note: in expansion of macro 
__pa
 #define virt_to_page(kaddr) pfn_to_page(__pa(kaddr) >> PAGE_SHIFT)
                                         ^~~~
/build/nvidia/src/NVIDIA-Linux-x86-387.34/kernel/common/inc/nv-linux.h:740:39: note: in expansion of macro 
virt_to_page
 #define NV_GET_PAGE_STRUCT(phys_page) virt_to_page(__va(phys_page))
                                       ^~~~~~~~~~~~
/build/nvidia/src/NVIDIA-Linux-x86-387.34/kernel/common/inc/nv-linux.h:740:52: note: in expansion of macro 
__va
 #define NV_GET_PAGE_STRUCT(phys_page) virt_to_page(__va(phys_page))
                                                    ^~~~
/build/nvidia/src/NVIDIA-Linux-x86-387.34/kernel/common/inc/nv-linux.h:1945:32: note: in expansion of macro 
NV_GET_PAGE_STRUCT
 #define NV_KUNMAP(phys) kunmap(NV_GET_PAGE_STRUCT((NvU64)phys))
                                ^~~~~~~~~~~~~~~~~~
/build/nvidia/src/NVIDIA-Linux-x86-387.34/kernel/nvidia/os-interface.c:824:5: note: in expansion of macro 
NV_KUNMAP
     NV_KUNMAP((NvU64)addr);
     ^~~~~~~~~
18Packages: Build-listBug ReportMediumLow[android-tools] missing a -latomic when linking adb (an...New
0%
Task Description

Didn’t find the place where to report this upstream!?

20Packages: Build-listBug ReportMediumLow[sagemath-doc] building documentation using Sphinx segf...New
0%
Task Description
[tutorial ] Saved pickle file: citations.pickle
[tutorial ] Exception occurred:
[tutorial ] File "/usr/lib/python2.7/site-packages/sphinx/environment/__init__.py", line 152, in dump
[tutorial ] pickle.dump(env, f, pickle.HIGHEST_PROTOCOL)
[tutorial ] MemoryError
[tutorial ] The full traceback has been saved in /tmp/sphinx-err-kSNZ9A.log, if you want to report the issue to the developers.
[tutorial ] Please also report this if it was a user error, so that a better error message can be provided next time.
[tutorial ] A bug report can be filed in the tracker at . Thanks!
Build finished. The built documents can be found in /build/sagemath-doc/src/sage-8.1/src/doc/html/ja/tutorial
/startdir/PKGBUILD: line 79:  2540 Segmentation fault      (core dumped) python2 sage_setup/docbuild --no-pdf-links -k all html
==> ERROR: A failure occurred in build().
    Aborting...
==> ERROR: Build failed, check /data/archbuild/staging-i686/copy/build
28Packages: Build-listBug ReportMediumLowpostgrest: checks start a Postgresql server and then te...New
0%
Task Description
Starting check()...
WARNING [pifpaf.drivers] `psutil.Popen(pid=2683, status='terminated')` is already gone, sending SIGKILL to its process group
WARNING [pifpaf.drivers] `psutil.Popen(pid=2671, status='terminated')` is already gone, sending SIGKILL to its process group
WARNING [pifpaf.drivers] `psutil.Popen(pid=2669, status='terminated')` is already gone, sending SIGKILL to its process group
ERROR [pifpaf] Error while running command: [b'/usr/bin/pg_ctl', '-w', '-o', '-k /tmp/tmp5_5e9_hy -p 5432 -h "127.0.0.1"', 'start']                                                                                
createdb: could not connect to database template1: could not connect to server: No such file or directory         
Is the server running locally and accepting                                                               
connections on Unix domain socket "/run/postgresql/.s.PGSQL.5432"? ERROR: A failure occurred in check().                                                                    
Aborting...                                           
ERROR: Build failed, check /data/archbuild/staging-i686/arch32/build                       

Disabling tests for now.

29Packages: Build-listBug ReportMediumLow[haskell-hslua] check() failsNew
0%
Task Description

several failures during check() - disabling for now

==> Starting check()...
Running 1 test suites...
Test suite test-hslua: RUNNING...
hslua

Haskell version of the C API
  copy
    copies stack elements using positive indices:               OK
    copies stack elements using negative indices:               OK
  insert
    inserts stack elements using negative indices:              OK
    inserts stack elements using negative indices:              OK
  absindex:                                                     OK
  gettable gets a table value:                                  FAIL
    test/Test/HsLua/Util.hs:35:
    lua operation returned false
  strlen, objlen, and rawlen all behave the same:               OK
  Type checking
    isfunction:                                                 OK
    isnil:                                                      OK
    isnone:                                                     OK
    isnoneornil:                                                OK
  CFunction handling:                                           OK
  getting values
    tointegerx returns numbers verbatim:                        OK
    tointegerx accepts strings coercible to integers:           OK
    tointegerx returns Nothing when given a boolean:            OK
    tonumberx returns numbers verbatim:                         OK
    tonumberx accepts strings as numbers:                       OK
    tonumberx returns Nothing when given a boolean:             OK
  setting and getting a global works:                           OK
  can push and receive a thread:                                OK
  different threads are not equal:                              OK
  thread status:                                                OK
  loading
    loadstring status:                                          OK
    dostring loading:                                           OK
    dofile loading:                                             OK
  pcall status:                                                 OK
  garbage collection:                                           OK
  compare
    identifies strictly smaller values:                         FAIL
      *** Failed! Assertion failed (after 1 test): 
      LuaInteger 0
      Use --quickcheck-replay=586817 to reproduce.
    identifies smaller or equal values:                         FAIL
      *** Failed! Assertion failed (after 1 test): 
      LuaInteger 0
      Use --quickcheck-replay=316579 to reproduce.
    identifies equal values:                                    OK
      +++ OK, passed 100 tests.
  lessthan works:                                               FAIL
    *** Failed! Assertion failed (after 2 tests): 
    LuaNumber (-0.35170612)
    LuaNumber 0.84471506
    Use --quickcheck-replay=507888 to reproduce.
  order of Lua types is consistent:                             OK
    +++ OK, passed 100 tests.
  functions can throw a table as error message:                 OK
  handling table errors won't leak:                             OK
Interoperability
  call haskell functions from lua
    push haskell function to lua:                               OK
    push multi-argument haskell function to lua:                OK
    argument type errors are propagated:                        OK
    convert haskell function to c function:                     OK
    Error in Haskell function is converted into Lua error:      OK
  call lua function from haskell
    test equality within lua:                                   FAIL
      test/Foreign/Lua/FunctionCallingTest.hs:106:
      raw equality test failed
      expected: True
       but got: False
    failing lua function call:                                  OK
    print the empty string via lua procedure:                   

OK

    failing lua procedure call:                                 OK
Utilities
  Optional return the value if it exists:                       OK
  Optional can deal with missing values:                        OK
  raiseError causes a Lua error:                                OK
Sendings and receiving values from the stack
  peek and push are well behaved
    Peek can act as left inverse of push
      round-tripping unit:                                      OK
        +++ OK, passed 100 tests.
      booleans remain equal under push/peek:                    OK
        +++ OK, passed 100 tests.
      lua numbers (i.e., doubles) remain equal under push/peek: FAIL
        *** Failed! Assertion failed (after 2 tests): 
        LuaNumber (-1.926296)
        Use --quickcheck-replay=670723 to reproduce.
      lua integers remain equal under push/peek:                IGNORED
      bytestring remain equal under push/peek:                  OK
        +++ OK, passed 100 tests.
      round-tripping strings:                                   OK (0.01s)
        +++ OK, passed 100 tests.
      lists of boolean remain equal under push/peeks:           OK
        +++ OK, passed 100 tests.
      lists of lua integers remain equal under push/peek:       IGNORED
      lists of bytestrings remain equal under push/peek:        OK (0.15s)
        +++ OK, passed 100 tests.
      text:                                                     OK
        +++ OK, passed 100 tests.
      map of strings to LuaNumber:                              FAIL
        *** Failed! Assertion failed (after 2 tests and 1 shrink): 
        fromList [("",LuaNumber (-0.9010369))]
        Use --quickcheck-replay=119067 to reproduce.
      tuples
        pair of LuaNumbers:                                     FAIL
          *** Failed! Assertion failed (after 2 tests): 
          (LuaNumber (-0.34098855),LuaNumber 0.2441068)
          Use --quickcheck-replay=296075 to reproduce.
        triple of LuaNumbers:                                   FAIL
          *** Failed! Assertion failed (after 2 tests): 
          (LuaNumber 0.46677026,LuaNumber 0.9009714,LuaNumber 0.2326173)
          Use --quickcheck-replay=85608 to reproduce.
        quadruple of LuaNumbers:                                FAIL
          *** Failed! Assertion failed (after 2 tests): 
          (LuaNumber 1.8909019,LuaNumber (-0.85486156),LuaNumber (-4.0685906),LuaNumber (-12.583851))
          Use --quickcheck-replay=305430 to reproduce.
        quintuple of LuaNumbers:                                FAIL
          *** Failed! Assertion failed (after 2 tests): 
          (LuaNumber 0.2735047,LuaNumber 2.1247218,LuaNumber 0.1806469,LuaNumber 0.9455812,LuaNumber 0.98733383)
          Use --quickcheck-replay=608867 to reproduce.
        hextuple of Text, LuaNumbers and Booleans:              FAIL
          *** Failed! Assertion failed (after 2 tests and 1 shrink): 
          (False,LuaNumber (-2.381176),"",False,LuaNumber (-0.8418731),LuaNumber (-0.39977068))
          Use --quickcheck-replay=572229 to reproduce.
        septuple of Text, LuaNumber and Booleans:               FAIL
          *** Failed! Assertion failed (after 2 tests and 3 shrinks): 
          ("",False,LuaNumber 1.3463217,False,False,LuaNumber (-1.4167022),False)
          Use --quickcheck-replay=692263 to reproduce.
        octuple of Strings and Booleans:                        OK (0.03s)
          +++ OK, passed 100 tests.
    Random stack values
      can push/pop booleans:                                    OK (0.01s)
        +++ OK, passed 100 tests.
      can push/pop lua integers:                                OK (0.01s)
        +++ OK, passed 100 tests.
      can push/pop lua numbers:                                 FAIL
        *** Failed! Assertion failed (after 3 tests): 
        LuaNumber 1.5588847
        Ordered {getOrdered = [Positive {getPositive = LuaInteger 1},Positive {getPositive = LuaInteger 2}]}
        Use --quickcheck-replay=197445 to reproduce.
      can push/pop bytestrings:                                 OK (0.02s)
        +++ OK, passed 100 tests.
      can push/pop lists of booleans:                           OK (0.04s)
        +++ OK, passed 100 tests.
      can push/pop lists of LuaIntegers:                        OK (0.04s)
        +++ OK, passed 100 tests.
      can push/pop lists of bytestrings:                        OK (0.19s)
        +++ OK, passed 100 tests.
  FromLuaStack
    receives basic values from the stack:                       OK
    returns an error if the types don't match:                  OK
    list cannot be read if a list element fails:                OK
    stack is unchanged if getting a list fails:                 OK
    stack is unchanged if getting key-value pairs fails:        OK
  ToLuaStack
    pushing simple values to the stack
      Boolean can be pushed correctly:                          OK
      LuaNumbers can be pushed correctly:                       FAIL
        test/Foreign/Lua/Types/ToLuaStackTest.hs:105:
        5::LuaNumber was not pushed
      LuaIntegers can be pushed correctly:                      FAIL
        test/Foreign/Lua/Types/ToLuaStackTest.hs:105:
        42::LuaInteger was not pushed
      ByteStrings can be pushed correctly:                      OK
      Unit is pushed as nil:                                    OK
      Pointer is pushed as light userdata:                      OK
    pushing a value increases stack size by one
      LuaInteger:                                               OK
        +++ OK, passed 100 tests.
      LuaNumber:                                                OK
        +++ OK, passed 100 tests.
      ByteString:                                               OK
        +++ OK, passed 100 tests.
      String:                                                   OK
        +++ OK, passed 100 tests.
      list of booleans:                                         OK
        +++ OK, passed 100 tests.
lua integration tests
  print version:                                                OK
  functions stored in / retrieved from registry:                OK
  getting a nested global works:                                OK
  setting a nested global works:                                OK
  table reading:                                                OK
  Getting strings to and from the stack
    unicode ByteString:                                         OK
    ByteString should survive after GC/Lua destroyed:           OK
    String with NUL byte should be pushed/popped correctly:     OK
  luaopen_* functions
    opendebug:                                                  OK
    openio:                                                     OK
    openmath:                                                   OK
    openos:                                                     OK
    openpackage:                                                OK
    openstring:                                                 OK
    opentable:                                                  OK
  luaopen_base returns the right number of tables
    openbase:                                                   OK
  C functions
    Registering a C function and calling it from Lua:           FAIL
      test/Foreign/LuaTest.hs:162:
      greeting function failed
      expected: Right ["Caffeine","induced","nonsense"]
       but got: Right []
    pushing a C closure to and calling it from Lua:             OK
  error handling
    lua errors are caught:                                      OK
    error-less code gives in 'Right' result:                    OK
    catching lua errors within the lua type:                    OK
    second alternative is used when first fails:                OK
    Applicative.empty implementation throws an exception:       OK
    catching error of a failing meta method:                    OK
    calling a function that errors throws exception:            OK

17 out of 112 tests failed (0.60s)
Test suite test-hslua: FAIL
Test suite logged to: dist/test/hslua-0.9.5-test-hslua.log
0 of 1 test suites (0 of 1 test cases) passed.
==> ERROR: A failure occurred in check().

36Packages: TestingBug ReportMediumLowtexlive-core: SSE2 requiredNew
0%
Task Description
(4/5) Updating TeXLive format files...
PANIC: unprotected error in call to Lua API (CPU with SSE2 required)
fmtutil [ERROR]: running `luajittex -ini   -jobname=luajittex -progname=luajittex luatex.ini /null' return status 1
fmtutil [ERROR]: return error due to options --strict
error: command failed to execute correctly
(5/5) Updating TeXLive font maps...

So, the problem seems to be in lua itself?

39Packages: TestingBug ReportMediumLowxorg modesetting module fails with illegal instructionNew
0%
Task Description
[    22.717] (EE) Illegal instruction at address 0xb632cd37
[    22.718] (EE) 
Fatal server error:
[    22.718] (EE) Caught signal 4 (Illegal instruction). Server aborting
[    22.719] (EE) 


                 PID: 242 (Xorg)
           UID: 0 (root)
           GID: 0 (root)
        Signal: 6 (ABRT)
     Timestamp: Wed 2018-06-13 20:53:43 CEST (41s ago)
  Command Line: /usr/lib/Xorg :0
    Executable: /usr/lib/Xorg
 Control Group: /user.slice/user-0.slice/session-c1.scope
          Unit: session-c1.scope
         Slice: user-0.slice
       Session: c1
     Owner UID: 0 (root)
       Boot ID: ea12301d13874fac8112dad7bf566bdb
    Machine ID: 2f98089cbe8d40cb8776a580d6803b58
      Hostname: arch32-staging
       Storage: /var/lib/systemd/coredump/core.Xorg.0.ea12301d13874fac8112dad7bf566bdb.242.1528916023000>
       Message: Process 242 (Xorg) of user 0 dumped core.
                
                Stack trace of thread 242:
                #0  0x00000000b7f58d21 __kernel_vsyscall (linux-gate.so.1)
                #1  0x00000000b7d749c2 raise (libc.so.6)
                #2  0x00000000b7d5e71e abort (libc.so.6)
                #3  0x000000000056b555 OsAbort (Xorg)
                #4  0x000000000056b5d2 FatalError (Xorg)
                #5  0x000000000060a93a n/a (Xorg)
                #6  0x00000000b7f58d38 __kernel_rt_sigreturn (linux-gate.so.1)
                #7  0x00000000b632cd37 n/a (kms_swrast_dri.so)
                #8  0x00000000b5f0181f n/a (kms_swrast_dri.so)
                #9  0x00000000b7f698b3 call_init.part.0 (ld-linux.so.2)
                #10 0x00000000b7f699b2 _dl_init (ld-linux.so.2)
                #11 0x00000000b7f6d7e0 dl_open_worker (ld-linux.so.2)
                #12 0x00000000b7e7bc91 _dl_catch_exception (libc.so.6)
                #13 0x00000000b7f6d077 _dl_open (ld-linux.so.2)
                #14 0x00000000b7b8cb73 n/a (libdl.so.2)
                #15 0x00000000b7e7bc91 _dl_catch_exception (libc.so.6)
                #16 0x00000000b7e7bd40 _dl_catch_error (libc.so.6)
                #17 0x00000000b7b8d333 n/a (libdl.so.2)
                #18 0x00000000b7b8cc16 dlopen (libdl.so.2)
                #19 0x00000000b7f2eb6e n/a (libgbm.so.1)
                #20 0x00000000b7f2ecb3 n/a (libgbm.so.1)
                #21 0x00000000b7f2ee24 n/a (libgbm.so.1)
                #22 0x00000000b7f2f0d7 n/a (libgbm.so.1)
                #23 0x00000000b7f2c9ba gbm_create_device (libgbm.so.1)
                #24 0x00000000b6ef4ee4 glamor_egl_init (libglamoregl.so)
                #25 0x00000000b7f49b4a n/a (modesetting_drv.so)
                #26 0x000000000051c169 InitOutput (Xorg)
                #27 0x000000000049d8e1 n/a (Xorg)
                #28 0x00000000b7d60041 __libc_start_main (libc.so.6)
                #29 0x000000000049e7e2 _start (Xorg)
43Packages: Build-listBug ReportMediumLowqt5-webengine, firefox, firefox-developer-edition use t...New
0%
Task Description
In file included from gen/third_party/WebKit/public/platform/modules/presentation/presentation.mojom-shared.h:24,
                 from gen/third_party/WebKit/public/platform/modules/presentation/presentation.mojom.h:37,
                 from ../../../../qtwebengine-everywhere-src-5.11.0/src/3rdparty/chromium/content/browser/frame_host/render_frame_host_impl.h:66,
                 from ../../../../qtwebengine-everywhere-src-5.11.0/src/3rdparty/chromium/content/browser/frame_host/frame_tree_node.h:18,
                 from ../../../../qtwebengine-everywhere-src-5.11.0/src/3rdparty/chromium/content/browser/devtools/browser_devtools_agent_host.cc:21:
gen/third_party/WebKit/public/platform/modules/presentation/presentation.mojom-shared-internal.h:139:35: warning: alignment 1 of ‘blink::mojom::internal::PresentationConnectionMessage_Data’ is less than 8 [-Wpacked-not-aligned]
 class MOJOM_SHARED_CONTENT_EXPORT PresentationConnectionMessage_Data {
                                   ^~~~~~~~~~~~~~~~~~~~~~~~~~~~~~~~~~
virtual memory exhausted: Cannot allocate memory
ninja: build stopped: subcommand failed.

Also in firefox:

91:37.06 ../../build/unix/gold/ld: fatal error: libxul.so: mmap: failed to allocate 1703955732 bytes for output file: Cannot allocate memory
91:37.06 collect2: error: ld returned 1 exit status
91:37.06 make[4]: *** [/build/firefox/src/mozilla-unified/config/rules.mk:701: libxul.so] Error 1
91:37.06 make[3]: *** [/build/firefox/src/mozilla-unified/config/recurse.mk:73: toolkit/library/target] Error 2
91:37.06 make[2]: *** [/build/firefox/src/mozilla-unified/config/recurse.mk:33: compile] Error 2
91:37.06 make[1]: *** [/build/firefox/src/mozilla-unified/config/rules.mk:434: default] Error 2
91:37.06 make: *** [client.mk:168: build] Error 2
46Packages: Build-listBug ReportMediumLowelectron - pic issuesNew
0%
Task Description

/usr/bin/clang++ -Wl,-O1,–sort-common,–as-needed,-z,relro,-z,now -Wl,-z,noexecstack -Wl,-rpath=\$ORIGIN -rdynamic -Wl,–export-dynamic -pthread -Wl,–no-keep-memory –sysroot=/ -Lusr/lib/libfakeroot -Wl,-rpath-link=usr/lib/libfakeroot -m32 -Wl,-z,noexecstack -Wl,-O1 -Wl,–as-needed -Wl,–gc-sections -flto=thin -fuse-ld=lld -Wl,–icf=all -Wl,–lto-O0 -Wl,-mllvm,-function-sections -Wl,-mllvm,-data-sections -Wl,-rpath-link=lib/ -o electron -Wl,–start-group obj/atom/app/electron.atom_main.o obj/libelectron_lib.a obj/brightray/libbrightray.a obj/vendor/breakpad/libbreakpad_client.a -Wl,–end-group lib/libnode.so -Wl,–start-group /build/electron/src/electron/vendor/libchromiumcontent/dist/main/static_library/libangle.a /build/electron/src/electron/vendor/libchromiumcontent/dist/main/static_library/libbase.a /build/electron/src/electron/vendor/libchromiumcontent/dist/main/static_library/libcc.a /build/electron/src/electron/vendor/libchromiumcontent/dist/main/static_library/libchromiumcontent.a /build/electron/src/electron/vendor/libchromiumcontent/dist/main/static_library/libcomponents.a /build/electron/src/electron/vendor/libchromiumcontent/dist/main/static_library/libmedia.a /build/electron/src/electron/vendor/libchromiumcontent/dist/main/static_library/libnet.a /build/electron/src/electron/vendor/libchromiumcontent/dist/main/static_library/libpdfium.a /build/electron/src/electron/vendor/libchromiumcontent/dist/main/static_library/libppapi.a /build/electron/src/electron/vendor/libchromiumcontent/dist/main/static_library/libservices.a /build/electron/src/electron/vendor/libchromiumcontent/dist/main/static_library/libskia.a /build/electron/src/electron/vendor/libchromiumcontent/dist/main/static_library/libwebkit.a /build/electron/src/electron/vendor/libchromiumcontent/dist/main/static_library/libwebkitbindings.a /build/electron/src/electron/vendor/libchromiumcontent/dist/main/static_library/libwebkitcore.a /build/electron/src/electron/vendor/libchromiumcontent/dist/main/static_library/libwebkitmodules.a /build/electron/src/electron/vendor/libchromiumcontent/dist/main/static_library/libwebrtc.a -Wl,–end-group -lpthread -lgtk-3 -lgdk-3 -lpangocairo-1.0 -lpango-1.0 -lfribidi -latk-1.0 -lcairo-gobject -lcairo -lgdk_pixbuf-2.0 -lgio-2.0 -lgobject-2.0 -ldbus-1 -lX11-xcb -lxcb -lXi -lXcursor -lXdamage -lXrandr -lXcomposite -lXext -lXfixes -lXrender -lX11 -lXtst -lXss -lgconf-2 -lgmodule-2.0 -lglib-2.0 -lssl3 -lsmime3 -lnss3 -lnssutil3 -lplds4 -lplc4 -lnspr4 -lasound -lcap -lcups -lrt -ldl -lresolv -lfontconfig -lexpat -lavcodec -lavformat -lavutil -levent -lFLAC -lharfbuzz-icu -lharfbuzz -ljsoncpp -lminizip -lpulse -lvpx -lwebpdemux -lwebpmux -lwebp -lxslt -lm -lxml2 -lz -ljpeg -lre2 -lsnappy -latomic
/usr/bin/ld.lld: error: can’t create dynamic relocation R_386_32 against local symbol in readonly segment; recompile object files with -fPIC
>>> defined in /build/electron/src/electron/vendor/libchromiumcontent/dist/main/static_library/libchromiumcontent.a(dct.o)
>>> referenced by ../../third_party/openh264/src/codec/common/x86/dct.asm
>>> dct.o:(.text+0×337) in archive /build/electron/src/electron/vendor/libchromiumcontent/dist/main/static_library/libchromiumcontent.a

I doubt, that this file gets compiled at all - the only occurences upto the above are:
[29/30] AR obj/chromiumcontent/libchromiumcontent.a
and
[34/16236] COPY /build/electron/src/electron/vendor/libchromiumcontent/src/out-ia32/static_library/obj/chromiumcontent/libchromiumcontent.a

57Packages: StableBug ReportLowLowlibc fails on AMD-K6New
0%
Task Description

pacstrap /test base
LD_LIBRARY_PATH=/test/usr/lib gdb –args /test/bin/bash results in:

Program terminated with signal SIGILL, Illegal instruction.
#0  0xb7619991 in strcmp () from /test/usr/lib/libc.so.6
(gdb) bt
#0  0xb7619991 in strcmp () from /test/usr/lib/libc.so.6
#1  0xb75bd41f in setlocale () from /test/usr/lib/libc.so.6
#2  0x0076b7f2 in ?? ()
#3  0x0053acf6 in ?? ()
#4  0xb75b3a31 in __libc_start_main () from /test/usr/lib/libc.so.6
#5  0x0053e561 in ?? ()

So, getting the exact failing opcode is hard.

2.28-5.0 was ok,
2.28-5.2 is not.

So it’s something we changed or something changed on one of the i486 build slaves.

Happens only on the AMD-K6, all other machines with CPUs with limited special instruction
sets (Pentium-S, AMD Geode) are working fine.

3Packages: StableBug ReportVery LowLow[ffmpeg] missing FLAC codecUnconfirmed
0%
Task Description

Playing 10.Motion_Picture_Soundtrack.flac.
Audio only file format detected.
Load subtitles in ./

Opening audio decoder: [ffmpeg] FFmpeg/libavcodec audio decoders
[flac @ 0xb68902c0]Got unexpected packet size after a partial decode
[flac @ 0xb68902c0]Got unexpected packet size after a partial decode
[flac @ 0xb68902c0]Got unexpected packet size after a partial decode
[flac @ 0xb68902c0]Got unexpected packet size after a partial decode
[flac @ 0xb68902c0]Got unexpected packet size after a partial decode
[flac @ 0xb68902c0]Got unexpected packet size after a partial decode
ADecoder init failed sad
ADecoder init failed sad
Cannot find codec for audio format 0x43614C66.
Audio: no sound
Video: no video

42PackagesBug ReportVery LowLow[xorg-server] 1.20 / [xf86-video-intel] gives me proble...Unconfirmed
0%
Task Description

The following update gives me problems with [tigervnc]’s vncviewer:

extra/xf86-video-intel    1:2.99.917+829+gd7dfab62-1.0 -> 1:2.99.917+831+ge7bfc906-1.0
extra/xorg-server         1.19.6+13+gd0d1a694f-2.1     -> 1.20.0-5.0  
extra/xorg-server-common  1.19.6+13+gd0d1a694f-2.1     -> 1.20.0-5.0

With the update, vncviewer takes a large amount of CPU, and locks up, showing a fullscreen of a solid color; hitting F8 (the menu key) opens a solid rectangle where the menu should be, but the menu never renders.

I have confirmed on an x86_64 box that the x86_64 version of xorg-server 1.20 works fine, but it is not using Intel graphics. So I’m unsure if the problem is with xf86-video-intel, or if it’s an i686-specific problem in xorg-server.

52PackagesBug ReportVery LowLowSome packages are built by "Unknown Packager"Unconfirmed
0%
Task Description

Some packages have

packager = Unknown Packager

, which is caused by

makepkg.conf:PACKAGER

not being set.

I analyzed every .pkg.tar.xz file in the Arch 32 repos (all architectures). The earliest Unknown Packager package was built on June 9, 2017, and they’ve been intermittent since then. Here’s a listing of how many times each packager appears:

      2  Dave Reisner 
      2  Fabio Castelli (Muflone) 
      2  Giancarlo Razzolini 
      2  Jelle van der Waa 
      2  Laurent Carlier 
      2  S?bastien Luttringer 
      2  schuay 
      3  Florian Pritz 
      3  Johannes L?thberg 
      4  Alexander R?dseth 
      4  Andreas Radke 
      4  Eli Schwartz 
      4  Tobias Powalowski 
      5  Gaetan Bisson 
      5  Jonathan Steel 
      6  Bart?omiej Piotrowski 
      6  Erich Eckner 
      7  Kyle Keen 
      8  Evangelos Foutras 
      8  Maxime Gauduin 
      9  Jaroslav Lichtblau 
      9  Lukas Fleischer 
     18  BlackEagle 
     21  Sergej Pupykin 
     22  Guillaume ALAUX 
     29  Sven-Hendrik Haase 
     32  Levente Polyak 
     35  Jan Alexander Steffens (heftig) 
     39  Felix Yan 
     43  Jan de Groot 
     44  Andreas Baumann 
     75  Ball? Gy?rgy 
     81  Antonio Rojas 
   6592  Unknown Packager
  20577  Erich Eckner 
  ------------------------------------------------------------------
  27707  total

This causes a problem for us in Parabola, because we just started applying the usual upload checks from

db-update

to packages that we import.

53PackagesBug ReportVery LowLow[gnome-terminal]: fails to startUnconfirmed
0%
Task Description

using openbox (not gnome)

$ gnome-terminal 
# Couldn't register with accessibility bus: Did not receive a reply.
Possible causes include: the remote application did not send a reply,
the message bus security policy blocked the reply, the reply timeout expired,
 or the network connection was broken.
# Error constructing proxy for org.gnome.Terminal:/org/gnome/Terminal/Factory0:
Error calling StartServiceByName for org.gnome.Terminal: Timeout was reached
54Packages: StableBug ReportVery LowLow[pam] links against libaudit, but doesn't declare a dep...Unconfirmed
0%
Task Description

Both core/pam 1.3.1-1.2 and staging/pam 1.3.1-1.3 have their libpam.so link against libaudit:

$ readelf --dynamic /usr/lib/libpam.so.0.84.2 

Dynamic section at offset 0xfdbc contains 27 entries:
  Tag        Type                         Name/Value
 0x00000001 (NEEDED)                     Shared library: [libaudit.so.1]
…

However, the package does not declare depends=(audit) (’audit’ is the package that contains libaudit.so).

This is normally a fairly invisible mistake because recent versions of systemd depend on audit, so systemd-users (i.e. most users) will have audit installed anyway.

This affects `su` (of util-linux) and `sudo` (of sudo), which both link against libpam.

Showing tasks 1 - 17 of 17 Page 1 of 1

Available keyboard shortcuts

Tasklist

Task Details

Task Editing