IDCategoryTask TypePrioritySeveritySummaryStatusProgress
174PackagesBug ReportMediumLowfirefox 87.0 doens't buildNew
0%
Task Description

Again, we get into out-of-memory situations with rust:

pentium4
41:24.75   cargo:warning=src/vector_type.h:502:11: warning: ‘void* memcpy(void*, const void*, size_t)’ writing to an object of type ‘struct glsl::vec4’ with no trivial copy-assignment; use copy-assignment or copy-initialization instead [-Wclass-memaccess]
41:24.75   cargo:warning=  502 |     memcpy(&v, p, sizeof(v));
41:24.75   cargo:warning=      |     ~~~~~~^~~~~~~~~~~~~~~~~~
41:24.75   cargo:warning=In file included from src/gl.cc:78:
41:24.75   cargo:warning=src/glsl.h:1772:8: note: ‘struct glsl::vec4’ declared here
41:24.75   cargo:warning= 1772 | struct vec4 {
41:24.75   cargo:warning=      |        ^~~~
41:24.75   cargo:warning=
41:24.75   cargo:warning=cc1plus: out of memory allocating 21906724 bytes after a total of 213745664 bytes

i686
 6:42.75    Compiling geckoservo v0.0.1 (/build/firefox/src/firefox-87.0/servo/ports/geckolib)
Process Process-1:
Traceback (most recent call last):
  File "/usr/lib/python3.9/multiprocessing/process.py", line 315, in _bootstrap
    self.run()
  File "/usr/lib/python3.9/multiprocessing/process.py", line 108, in run
    self._target(*self._args, **self._kwargs)
  File "/build/firefox/src/firefox-87.0/testing/mozbase/mozsystemmonitor/mozsystemmonitor/resourcemonitor.py", line 141, in _collect
    while not _poll(pipe, poll_interval=sleep_interval):
  File "/build/firefox/src/firefox-87.0/testing/mozbase/mozsystemmonitor/mozsystemmonitor/resourcemonitor.py", line 107, in _poll
    return pipe.poll(poll_interval)
  File "/usr/lib/python3.9/multiprocessing/connection.py", line 262, in poll
    return self._poll(timeout)
  File "/usr/lib/python3.9/multiprocessing/connection.py", line 429, in _poll
    r = wait([self], timeout)
  File "/usr/lib/python3.9/multiprocessing/connection.py", line 936, in wait
    ready = selector.select(timeout)
  File "/usr/lib/python3.9/selectors.py", line 416, in select
    fd_event_list = self._selector.poll(timeout)
KeyboardInterrupt
52:46.35 make[4]: *** [/build/firefox/src/firefox-87.0/config/makefiles/rust.mk:348: force-cargo-library-build] Interrupt
52:46.35 make[3]: *** [/build/firefox/src/firefox-87.0/config/recurse.mk:72: toolkit/library/rust/target] Interrupt
52:46.35 make[2]: *** [/build/firefox/src/firefox-87.0/config/recurse.mk:34: compile] Interrupt
52:46.35 make[1]: *** [/build/firefox/src/firefox-87.0/config/rules.mk:355: default] Interrupt

Rust is 1.51.0 on both pentium4 and i686.

 168 DevopsBug ReportMediumLow i486 slaves are no longer working Closed
100%
Task Description

+ exec setarch i486 systemd-nspawn -q -D /var/lib/archbuild/staging-i486/root -E PATH=/usr/local/sbin:/usr/local/bin:/usr/bin –register=no –keep-unit –as-pid2 –bind=/var/cache/archbuild32 pacman -Syuu –noconfirm
error: failed to initialize alpm library

 166 PackagesBug ReportMediumLow s2n-tls: failing tests Closed
100%
Task Description

The following tests FAILED:

       91 - s2n_pq_kem_hybrid_kat_test (Failed)
      145 - s2n_session_ticket_test (Failed)
      154 - s2n_stuffer_network_order_test (Failed)
      184 - s2n_x509_validator_test (Failed)

https://github.com/aws/s2n-tls/issues/2405 https://github.com/aws/s2n-tls/issues/2406 https://github.com/aws/s2n-tls/issues/2404

3 are known upstream too.

 165 PackagesBug ReportMediumLow xorgproto check() fails Closed
100%
Task Description

———————————– output ———————————– stderr:
Traceback (most recent call last):

File "/build/xorgproto/src/xorgproto-2021.3/scripts/keysym-generator.py", line 18, in <module>
  import libevdev

ModuleNotFoundError: No module named ‘libevdev’

root cause is python-libevdev not building:

Theme error:
sphinx_rtd_theme is no longer a hard dependency since version 1.4.0. Please install it manually.(pip install sphinx_rtd_theme)

another victim of documentation generation..

164PackagesBug ReportMediumLowpam_systemd.so hangs openssh 2 out of 3 timesNew
0%
Task Description

Effect: you can not log in.
The SSHd child runs on 100% CPU doing something.
This happens on i486, i686 and pentium4 equally.

163PackagesBug ReportMediumLowsphinx_rtd_theme is used to build documentation but doe...Assigned
0%
Task Description
build
running build_py
npm WARN npm npm does not support Node.js v15.9.0
npm WARN npm You should probably upgrade to a newer version of node as we
npm WARN npm can't make any promises that npm will work with this version.
npm WARN npm Supported releases of Node.js are the latest release of 6, 8, 9, 10, 11, 12, 13.
npm WARN npm You can find the latest version at https://nodejs.org/

> sphinx_rtd_theme@0.5.1 preinstall /build/python-sphinx_rtd_theme/src/sphinx_rtd_theme-0.5.1
> bin/preinstall.js

Traceback (most recent call last):
  File "/build/python-sphinx_rtd_theme/src/sphinx_rtd_theme-0.5.1/setup.py", line 86, in <module>
    setup(
  File "/usr/lib/python3.9/site-packages/setuptools/__init__.py", line 153, in setup
    return distutils.core.setup(**attrs)
  File "/usr/lib/python3.9/distutils/core.py", line 148, in setup
    dist.run_commands()
  File "/usr/lib/python3.9/distutils/dist.py", line 966, in run_commands
    self.run_command(cmd)
  File "/usr/lib/python3.9/distutils/dist.py", line 985, in run_command
    cmd_obj.run()
  File "/usr/lib/python3.9/distutils/command/build.py", line 135, in run
    self.run_command(cmd_name)
  File "/usr/lib/python3.9/distutils/cmd.py", line 313, in run_command
    self.distribution.run_command(command)
  File "/usr/lib/python3.9/distutils/dist.py", line 985, in run_command
    cmd_obj.run()
  File "/build/python-sphinx_rtd_theme/src/sphinx_rtd_theme-0.5.1/setup.py", line 22, in run
    subprocess.run(['npm', 'install'], check=True)
  File "/usr/lib/python3.9/subprocess.py", line 524, in run
    raise CalledProcessError(retcode, process.args,
subprocess.CalledProcessError: Command '['npm', 'install']' died with <Signals.SIGSEGV: 11>.
==> ERROR: A failure occurred in build().
    Aborting...
==> ERROR: Build failed, check /var/lib/archbuild/staging-pentium4/abaumann/build
162PackagesBug ReportMediumLowbrowsers based on Chromium break in secomp sanboxingAssigned
0%
Task Description

Everything using chromium/seccomp jailing breaks currently including chromium due to missing IA-32
rules in libseccomp and/or chromium itself.

Firefox seems to work fine.
epiphany works.
midori works.
luakit works.

Chromium crashes with sigsegv (I would expect something which reminds me of a seccomp syscall?).

konqueror, falkon, qutebrowser are based on qt5-webengine. They all open up but then don’t render a page (issuing the seccomp error messages attached below).

vivaldi the same, but as it is closed source, we cannot fix it.

 161 PackagesBug ReportMediumLow buildbot fails to build Closed
100%
Task Description

/usr/bin/true install -e pkg
/usr/bin/true install mock wheel buildbot
cd www/build_common; yarn install –pure-lockfile
yarn install v1.22.10
warning package.json: No license field
warning buildbot-build-common@1.0.0: No license field
[1/4] Resolving packages… [2/4] Fetching packages… make: *** [Makefile:63: frontend_deps] Segmentation fault (core dumped)

 160 PackagesBug ReportMediumLow konqueror fails to work Closed
100%
Task Description

re.so.8 error messages, re.so.9 is in stable

and then segfaults in libQt5WebEngineCore

 159 PackagesBug ReportMediumLow prjtrellis doesn't build Closed
100%
Task Description

Running Sphinx v3.5.1
/bin/sh: line 1: git: command not found
making output directory… done
WARNING: html_static_path entry ‘_static’ does not exist

Theme error:
sphinx_rtd_theme is no longer a hard dependency since version 1.4.0. Please install it manually.(pip install sphinx_rtd_theme)
{’code2docs’: {}, ‘docs2code’: {}}
make: *** [Makefile:24: html] Error 2

If I remember correctly, then some Spinx schemes need yarn to build, so they are no longer
buildable.
This means all packages needing that theme for documentation purposes are failing.

Maybe buildable without documentation for now?

158PackagesBug ReportMediumLowprotobuf python bindings fail to buildNew
0%
Task Description

OK (skipped=10)
Traceback (most recent call last):

File "/usr/lib/python3.9/site-packages/packaging/version.py", line 57, in parse
  return Version(version)
File "/usr/lib/python3.9/site-packages/packaging/version.py", line 298, in __init__
  raise InvalidVersion("Invalid version: '{0}'".format(version))

packaging.version.InvalidVersion: Invalid version: ‘/build/protobuf/src/protobuf’

During handling of the above exception, another exception occurred:

Traceback (most recent call last):

File "/build/protobuf/src/protobuf-3.12.4/python/setup.py", line 251, in <module>
  setup(
File "/usr/lib/python3.9/site-packages/setuptools/__init__.py", line 153, in setup
  return distutils.core.setup(**attrs)
File "/usr/lib/python3.9/distutils/core.py", line 148, in setup
  dist.run_commands()
File "/usr/lib/python3.9/distutils/dist.py", line 966, in run_commands
  self.run_command(cmd)
File "/usr/lib/python3.9/distutils/dist.py", line 985, in run_command
  cmd_obj.run()
File "/usr/lib/python3.9/site-packages/setuptools/command/test.py", line 232, in run
  self.run_tests()
File "/usr/lib/python3.9/contextlib.py", line 124, in __exit__
  next(self.gen)
File "/usr/lib/python3.9/site-packages/setuptools/command/test.py", line 169, in project_on_sys_path
  working_set.__init__()
File "/usr/lib/python3.9/site-packages/pkg_resources/__init__.py", line 552, in __init__
  self.add_entry(entry)
File "/usr/lib/python3.9/site-packages/pkg_resources/__init__.py", line 608, in add_entry
  for dist in find_distributions(entry, True):
File "/usr/lib/python3.9/site-packages/pkg_resources/__init__.py", line 2059, in find_on_path
  path_item_entries = _by_version_descending(filtered)
File "/usr/lib/python3.9/site-packages/pkg_resources/__init__.py", line 2029, in _by_version_descending
  return sorted(names, key=_by_version, reverse=True)
File "/usr/lib/python3.9/site-packages/pkg_resources/__init__.py", line 2027, in _by_version
  return [packaging.version.parse(part) for part in parts]
File "/usr/lib/python3.9/site-packages/pkg_resources/__init__.py", line 2027, in <listcomp>
  return [packaging.version.parse(part) for part in parts]
File "/usr/lib/python3.9/site-packages/packaging/version.py", line 59, in parse
  return LegacyVersion(version)
File "/usr/lib/python3.9/site-packages/packaging/version.py", line 127, in __init__
  warnings.warn(

DeprecationWarning: Creating a LegacyVersion has been deprecated and will be removed in the next major release
=⇒ ERROR: A failure occurred in check().

  Aborting...

=⇒ ERROR: Build failed, check /var/lib/archbuild/staging-pentium4/abaumann/build

both i686 and pentium4

 157 PackagesBug ReportMediumLow gnome-control-center and epiphany don't start due to un ...Closed
100%
Task Description

Feb 19 10:22:46 arch32-stable-pentium4 gnome-control-center.desktop[10992]: gnome-control-center: symbol lookup error: /usr/lib/libwebkit2gtk-4.0.so.37: undefined symbol: wpe_fdo_initialize_shm

 156 PackagesBug ReportMediumLow Cinnamon fails to start Closed
100%
Task Description

Funny, but actually not really helping:

Feb 17 20:42:17 arch32-stable-pentium4 cinnamon-session[3846]: CRITICAL: t+0.01217s: We failed, but the fail whale is dead. Sorry....
 155 PackagesBug ReportMediumLow Display Manager GDM doesn't work Closed
100%
Task Description

We get the nice message “Oh no! Something has gone wrong”

 154 PackagesBug ReportMediumLow gedit fails to start Closed
100%
Task Description

gedit: error while loading shared libraries: libtepl-5.so.0: cannot open shared object file: No such file or directory

 153 PackagesBug ReportMediumLow plasma cannot be installed or updated Closed
100%
Task Description

:: removing user-manager breaks dependency ‘user-manager’ required by plasma-meta

 152 PackagesBug ReportMediumLow evolution cannot be installed or upgraded Closed
100%
Task Description

:: installing evolution-data-server (3.38.3-1.1) breaks dependency ‘libedataserver-1.2.so=24-32’ required by evolution

 151 PackagesBug ReportMediumLow Gnome cannot be installed Closed
100%
Task Description

:: installing mutter (3.38.3-1.0) breaks dependency ‘libmutter-6.so=0-32’ required by gnome-shell

let’s try to push mutter, making most of gnome happy, most likely breaking gnome-shell (if not
already broken).

 150 PackagesBug ReportMediumLow MATE doesn't start up Closed
100%
Task Description

no task description

 149 PackagesBug ReportMediumLow xfce desktop doesn't start Closed
100%
Task Description

no task description

 148 PackagesBug ReportMediumLow xfce4-power-man crashes Closed
100%
Task Description
Feb 12 12:00:29 arch32-testing-pentium4 kernel: audit: type=1130 audit(1613127629.283:106): pid=1 uid=0 auid=4294967295 ses=4294967295 msg='unit=systemd-coredump@0-9938-0 comm="systemd" exe="/usr/lib/systemd/systemd" hostname=? addr=? terminal=? res=success'
Feb 12 12:00:31 arch32-testing-pentium4 systemd-coredump[9939]: [🡕] Process 9886 (xfce4-power-man) of user 1000 dumped core.
                                                                
                                                                Stack trace of thread 9886:
                                                                #0  0x00000000b6fb37b4 g_log_structured_array (libglib-2.0.so.0 + 0x557b4)
                                                                #1  0x00000000b6fb3cdc g_log_default_handler (libglib-2.0.so.0 + 0x55cdc)
                                                                #2  0x00000000b6fb5224 g_logv (libglib-2.0.so.0 + 0x57224)
                                                                #3  0x00000000b6fb5485 g_log (libglib-2.0.so.0 + 0x57485)
                                                                #4  0x000000000041a4cf n/a (xfce4-power-manager + 0x64cf)
                                                                #5  0x00000000b6b5498d __libc_start_main (libc.so.6 + 0x1e98d)
                                                                #6  0x000000000041aa75 n/a (xfce4-power-manager + 0x6a75)
                                                                
                                                                Stack trace of thread 9901:
                                                                #0  0x00000000b7f12549 __kernel_vsyscall (linux-gate.so.1 + 0x549)
                                                                #1  0x00000000b6c22117 __poll (libc.so.6 + 0xec117)
                                                                #2  0x00000000b7000125 n/a (libglib-2.0.so.0 + 0xa2125)
                                                                #3  0x00000000b6faba46 g_main_context_iteration (libglib-2.0.so.0 + 0x4da46)
                                                                #4  0x00000000b6fabaa1 n/a (libglib-2.0.so.0 + 0x4daa1)
                                                                #5  0x00000000b6fda93e n/a (libglib-2.0.so.0 + 0x7c93e)
                                                                #6  0x00000000b6cfe39f start_thread (libpthread.so.0 + 0x839f)
                                                                #7  0x00000000b6c2db6a __clone (libc.so.6 + 0xf7b6a)
Feb 12 12:00:31 arch32-testing-pentium4 kernel: audit: type=1131 audit(1613127631.393:107): pid=1 uid=0 auid=4294967295 ses=4294967295 msg='unit=systemd-coredump@0-9938-0 comm="systemd" exe="/usr/lib/systemd/systemd" hostname=? addr=? terminal=? res=success'
 147 PackagesBug ReportMediumLow kpgp fails at startup Closed
100%
Task Description
Feb 12 11:57:48 arch32-testing-pentium4 audit[9829]: USER_LOGIN pid=9829 uid=0 auid=1000 ses=7 msg='op=login id=1000 exe="/usr/bin/lightdm" hostname=arch32-testing-pentium4 addr=? terminal=/dev/tty7 res=success'
Feb 12 11:57:48 arch32-testing-pentium4 kernel: audit: type=1112 audit(1613127468.816:104): pid=9829 uid=0 auid=1000 ses=7 msg='op=login id=1000 exe="/usr/bin/lightdm" hostname=arch32-testing-pentium4 addr=? terminal=/dev/tty7 res=success'
Feb 12 11:57:55 arch32-testing-pentium4 kaccess[9880]: Xlib XKB extension major= 1  minor= 0
Feb 12 11:57:56 arch32-testing-pentium4 kaccess[9880]: QStandardPaths: XDG_RUNTIME_DIR not set, defaulting to '/tmp/runtime-guest'
Feb 12 11:57:58 arch32-testing-pentium4 kaccess[9880]: "Session bus not found\nTo circumvent this problem try the following command (with Linux and bash)\nexport $(dbus-launch)"
Feb 12 11:58:00 arch32-testing-pentium4 kgpg[9909]: QStandardPaths: XDG_RUNTIME_DIR not set, defaulting to '/tmp/runtime-guest'
Feb 12 11:58:01 arch32-testing-pentium4 kgpg[9909]: QStandardPaths: XDG_RUNTIME_DIR not set, defaulting to '/tmp/runtime-guest'
Feb 12 11:58:01 arch32-testing-pentium4 kgpg[9909]: QStandardPaths: XDG_RUNTIME_DIR not set, defaulting to '/tmp/runtime-guest'
Feb 12 11:58:01 arch32-testing-pentium4 kgpg[9909]: "Session bus not found\nTo circumvent this problem try the following command (with Linux and bash)\nexport $(dbus-launch)"

 146 Packages: UpstreamBug ReportMediumLow trojita doesn't build, missing a patch, failures on qt  ...Closed
100%
Task Description

=⇒ ERROR: Failure while downloading https://cgit.kde.org/trojita.git/patch/?id=cf2364b8

SHA1 in https://anongit.kde.org/trojita):

cf2364b80fa8ae844df8350cd5833d47cce235f2

    Fix possible crash when downloading attachments

Yep, promising, lets download the patch and add it to the package.

Original bug: https://bugs.kde.org/show_bug.cgi?id=417697

/build/trojita/src/trojita-0.7/src/Gui/Window.cpp:981:26: error: aggregate ‘QPainterPath path’ has incomplete type and cannot be defined
  981 |             QPainterPath path;
      |                          ^~~~

needs a #include <QPainterPath>

Reported as https://bugs.kde.org/show_bug.cgi?id=432827

 145 PackagesBug ReportMediumLow glibc 2.33 breaks i686 and i486 architectures Closed
100%
Task Description
/usr/lib/libc.6: CPU ISA level is lower than required.

updating effectively breaks all commands!

For those lucky enough to have a pacman-static installed, they can
IMMEDIATEDY downgrade glibc and keep the machine alive.

This is considered a distribution-killing bug for i486 and i686.

Pentium4 is not affectted.

 144 PackagesBug ReportMediumLow firefox fails to build Closed
100%
Task Description
/build/seamonkey/src/seamonkey-2.53.5/obj-i686-pc-linux-gnu/_virtualenv/bin/python /build/seamonkey/src/s                                                                                                           eamonkey-2.53.5/mozilla/toolkit/mozapps/installer/packager.py -DMOZ_APP_NAME=seamonkey -DPREF_DIR=default                                                                                                           s/pref -DJAREXT= -DMOZ_CALENDAR=1 -DMOZ_GTK=1 -DMOZ_IRC=1 -DMOZ_DOMINSPECTOR=1 -DMOZ_SYSTEM_NSPR=1 -DMOZ_                                                                                                           SYSTEM_NSS=1 -DMOZ_MOVEMAIL=1 -DNECKO_WIFI=1 -DMOZ_BUNDLED_FONTS=1 -DMOZ_CHILD_PROCESS_NAME=plugin-contai                                                                                                           ner -DDLL_PREFIX=lib -DDLL_SUFFIX=.so -DBIN_SUFFIX= -DDIR_MACOS= -DDIR_RESOURCES= -DBINPATH=bin -DRESPATH                                                                                                           =bin -DLPROJ_ROOT=en -DCLANG_CXX -DA11Y_LOG=1 -DACCESSIBILITY=1 -DATK_MAJOR_VERSION=2 -DATK_MINOR_VERSION                                                                                                           =36 -DATK_REV_VERSION=0 -DBUILD_CTYPES=1 -DCROSS_COMPILE='' -DD_INO=d_ino -DENABLE_INTL_API=1 -DENABLE_SY                                                                                                           STEM_EXTENSION_DIRS=1 -DEXPOSE_INTL_API=1 -DFIREFOX_VERSION=60.7.5 -DFORCE_PR_LOG=1 -DFUNCPROTO=15 -DGDK_                                                                                                           VERSION_MAX_ALLOWED=GDK_VERSION_3_4 -DGLIB_VERSION_MAX_ALLOWED=GLIB_VERSION_2_32 -DGLIB_VERSION_MIN_REQUIRED=GLIB_VERSION_2_26 -DGL_PROVIDER_GLX=1 -DHAVE_ALLOCA_H=1 -DHAVE_BYTESWAP_H=1 -DHAVE_CLOCK_MONOTONIC=1 -DHAVE_CPUID_H=1 -DHAVE_DIRENT_H=1 -DHAVE_DLADDR=1 -DHAVE_DLOPEN=1 -DHAVE_FONTCONFIG_FCFREETYPE_H=1 -DHAVE_FT_BITMAP_SIZE_Y_PPEM=1 -DHAVE_FT_GLYPHSLOT_EMBOLDEN=1 -DHAVE_FT_LOAD_SFNT_TABLE=1 -DHAVE_GETOPT_H=1 -DHAVE_GETTID=1 -DHAVE_GMTIME_R=1 -DHAVE_I18N_LC_MESSAGES=1 -DHAVE_INTTYPES_H=1 -DHAVE_LCHOWN=1 -DHAVE_LINUX_IF_ADDR_H=1 -DHAVE_LINUX_PERF_EVENT_H=1 -DHAVE_LINUX_QUOTA_H=1 -DHAVE_LINUX_RTNETLINK_H=1 -DHAVE_LOCALECONV=1 -DHAVE_LOCALTIME_R=1 -DHAVE_LSTAT64=1 -DHAVE_MALLINFO=1 -DHAVE_MALLOC_H=1 -DHAVE_MALLOC_USABLE_SIZE=1 -DHAVE_MEMALIGN=1 -DHAVE_MEMMEM=1 -DHAVE_MOVEMAIL=1 -DHAVE_NETINET_IN_H=1 -DHAVE_NL_TYPES_H=1 -DHAVE_POSIX_FADVISE=1 -DHAVE_POSIX_FALLOCATE=1 -DHAVE_POSIX_MEMALIGN=1 -DHAVE_PTHREAD_H=1 -DHAVE_RES_NINIT=1 -DHAVE_SETPRIORITY=1 -DHAVE_STAT64=1 -DHAVE_STDINT_H=1 -DHAVE_STRERROR=1 -DHAVE_STRNDUP=1 -DHAVE_SYSCALL=1 -DHAVE_SYS_QUEUE_H=1 -DHAVE_SYS_QUOTA_H=1 -DHAVE_SYS_TYPES_H=1 -DHAVE_THREAD_TLS_KEYWORD=1 -DHAVE_TRUNCATE64=1 -DHAVE_UNISTD_H=1 -DHAVE_VALLOC=1 -DHAVE_VA_COPY=1 -DHAVE_VISIBILITY_ATTRIBUTE=1 -DHAVE_VISIBILITY_HIDDEN_ATTRIBUTE=1 -DHAVE__UNWIND_BACKTRACE=1 -DHAVE___CXA_DEMANGLE=1 -DJS_DEFAULT_JITREPORT_GRANULARITY=3 -DMALLOC_H='<malloc.h>' -DMALLOC_USABLE_SIZE_CONST_PTR='' -DMOZILLA_OFFICIAL=1 -DMOZILLA_UAVERSION='"60.0"' -DMOZILLA_VERSION='"60.7.5"' -DMOZILLA_VERSION_U=60.7.5 -DMOZ_ACCESSIBILITY_ATK=1 -DMOZ_ALLOW_LEGACY_EXTENSIONS=1 -DMOZ_APP_UA_NAME='""' -DMOZ_APP_UA_VERSION='"2.53.5"' -DMOZ_AV1=1 -DMOZ_BUILD_APP=../suite -DMOZ_BUNDLED_FONTS=1 -DMOZ_CONTENT_SANDBOX=1 -DMOZ_DAV1D_ASM=1 -DMOZ_DISABLE_STARTUPCACHE=1 -DMOZ_DISTRIBUTION_ID='"org.mozilla"' -DMOZ_DLL_SUFFIX='".so"' -DMOZ_ENABLE_DBUS=1 -DMOZ_ENABLE_MASK_AS_SHORTHAND=1 -DMOZ_ENABLE_SKIA=1 -DMOZ_ENABLE_STARTUP_NOTIFICATION=1 -DMOZ_ENABLE_XREMOTE=1 -DMOZ_FEEDS=1 -DMOZ_FFMPEG=1 -DMOZ_FFVPX=1 -DMOZ_FFVPX_FLACONLY=1 -DMOZ_FMP4=1 -DMOZ_GECKO_PROFILER=1 -DMOZ_GLUE_IN_PROGRAM=1 -DMOZ_GMP_SANDBOX=1 -DMOZ_INSTRUMENT_EVENT_LOOP=1 -DMOZ_LOGGING=1 -DMOZ_MACBUNDLE_ID=org.mozilla.seamonkey -DMOZ_MEMORY=1 -DMOZ_MORK=1 -DMOZ_PEERCONNECTION=1 -DMOZ_PERMISSIONS=1 -DMOZ_PLACES=1 -DMOZ_PULSEAUDIO=1 -DMOZ_RAW=1 -DMOZ_RUST_SIMD=1 -DMOZ_SAMPLE_TYPE_FLOAT32=1 -DMOZ_SANDBOX=1 -DMOZ_SCTP=1 -DMOZ_SEPARATE_MANIFEST_FOR_THEME_OVERRIDES=1 -DMOZ_SRTP=1 -DMOZ_STATIC_JS=1 -DMOZ_SUITE=1 -DMOZ_SYSTEM_ICU=1 -DMOZ_TREE_CAIRO=1 -DMOZ_UPDATE_CHANNEL=default -DMOZ_USER_DIR='".mozilla"' -DMOZ_VORBIS=1 -DMOZ_VPX_NO_MEM_REPORTING=1 -DMOZ_WEBM_ENCODER=1 -DMOZ_WEBRTC=1 -DMOZ_WEBRTC_ASSERT_ALWAYS=1 -DMOZ_WEBRTC_SIGNALING=1 -DMOZ_WEBSPEECH=1 -DMOZ_WEBSPEECH_TEST_BACKEND=1 -DMOZ_WIDGET_GTK=3 -DMOZ_X11=1 -DMOZ_XUL=1 -DNO_NSPR_10_SUPPORT=1 -DNS_PRINTING=1 -DNS_PRINT_PREVIEW=1 -DRELEASE_OR_BETA=1 -DSTATIC_JS_API=1 -DSTDC_HEADERS=1 -DTARGET_XPCOM_ABI='"x86-gcc3"' -DUSE_SKIA=1 -DUSE_SKIA_GPU=1 -DU_USING_ICU_NAMESPACE=0 -DVA_COPY=va_copy -DVPX_X86_ASM=1 -DXP_LINUX=1 -DXP_UNIX=1 -D_REENTRANT=1 -DAB_CD=en-US \
        --format omni \
        --removals /build/seamonkey/src/seamonkey-2.53.5/suite/installer/removed-files.in \
         \
         \
         \
         \
        --optimizejars \
        --disable-compression \
        package-manifest ../../dist ../../dist/seamonkey \
        --non-resource defaults/messenger/mailViews.dat defaults/profile/panels.rdf defaults/profile/mimeTypes.rdf defaults/profile/chrome/userChrome-example.css defaults/profile/chrome/userContent-example.css 
terminate called after throwing an instance of 'std::runtime_error'
  what():  Section index out of bounds
Traceback (most recent call last):
  File "/build/seamonkey/src/seamonkey-2.53.5/mozilla/toolkit/mozapps/installer/packager.py", line 326, in <module>
    main()
  File "/build/seamonkey/src/seamonkey-2.53.5/mozilla/toolkit/mozapps/installer/packager.py", line 320, in main
    copier.copy(args.destination)
  File "/build/seamonkey/src/seamonkey-2.53.5/mozilla/python/mozbuild/mozpack/copier.py", line 428, in copy
    copy_results.append((destfile, f.copy(destfile, skip_if_older)))
  File "/build/seamonkey/src/seamonkey-2.53.5/mozilla/python/mozbuild/mozpack/files.py", line 296, in copy
    elfhack(dest)
  File "/build/seamonkey/src/seamonkey-2.53.5/mozilla/python/mozbuild/mozpack/executables.py", line 124, in elfhack
    errors.fatal('Error executing ' + ' '.join(cmd))
  File "/build/seamonkey/src/seamonkey-2.53.5/mozilla/python/mozbuild/mozpack/errors.py", line 103, in fatal
    self._handle(self.FATAL, msg)
  File "/build/seamonkey/src/seamonkey-2.53.5/mozilla/python/mozbuild/mozpack/errors.py", line 98, in _handle
    raise ErrorMessage(msg)
mozpack.errors.ErrorMessage: Error: Error executing /build/seamonkey/src/seamonkey-2.53.5/obj-i686-pc-linux-gnu/build/unix/elfhack/elfhack ../../dist/seamonkey/libxul.so
make[2]: *** [/build/seamonkey/src/seamonkey-2.53.5/mozilla/toolkit/mozapps/installer/packager.mk:22: stage-package] Error 1
make[2]: Leaving directory '/build/seamonkey/src/seamonkey-2.53.5/obj-i686-pc-linux-gnu/suite/installer'
make[1]: *** [/build/seamonkey/src/seamonkey-2.53.5/mozilla/../suite/build.mk:13: install] Error 2
make[1]: Leaving directory '/build/seamonkey/src/seamonkey-2.53.5/obj-i686-pc-linux-gnu'
make: *** [client.mk:404: install] Error 2
==> ERROR: A failure occurred in package().
    Aborting...
==> ERROR: Build failed, check /var/lib/archbuild/slave1/staging-pentium4/slave1/build
used straw: :mirrored_source:mirrored_source_by_hash:

143PackagesBug ReportMediumLowthunderbird doesn't build and runAssigned
0%
Task Description

still linked against icu67.

Same here, I cannot believe that somebody is actually using thunderbird on Archlinux32 anymore.

Triggered rebuild, doesn’t build currently.

 142 PackagesBug ReportMediumLow gnome-terminal doesn't start Closed
100%
Task Description
# Error constructing proxy for org.gnome.Terminal:/org/gnome/Terminal/Factory0: Could not connect: Connection refused

As this is the case since months, I cannot imagine somebody is still using Gnome on Archlinux32..

 140 PackagesBug ReportMediumLow libproxy doesn't build Closed
100%
Task Description
-- Installing: /build/libproxy/pkg/libproxy/usr/include/proxy.h
-- Installing: /build/libproxy/pkg/libproxy/usr/bin/proxy
mv: cannot stat '/build/libproxy/pkg/libproxy/usr/lib/libproxy/*/modules/pacrunner_webkit.so': No such file or directory
==> ERROR: A failure occurred in package_libproxy().
    Aborting...
 139 PackagesBug ReportMediumLow webkit2gtk doesn't build Closed
100%
Task Description

This blocks tons of packages..

 138 PackagesBug ReportMediumLow polkit doesn't build because of a stuck js78 Closed
100%
Task Description

no task description

 137 PackagesBug ReportMediumLow llvm rebuild fails (aka sphinx requires a python module ...Closed
100%
Task Description
Configuration error:
There is a programmable error in your configuration file:

Traceback (most recent call last):
  File "/usr/lib/python3.9/site-packages/sphinx/config.py", line 326, in eval_config_file
    execfile_(filename, namespace)
  File "/usr/lib/python3.9/site-packages/sphinx/util/pycompat.py", line 88, in execfile_
    exec(code, _globals)
  File "/build/llvm/src/llvm-11.0.1.src/docs/conf.py", line 40, in <module>
    import recommonmark
ModuleNotFoundError: No module named 'recommonmark'
136PackagesBug ReportMediumLowHaskell probably completely fails to rebuildNew
0%
Task Description
Configuring attoparsec-0.13.2.4...
Error:
    The following packages are broken because other packages they depend on are missing. These broken packages must be rebuilt before they can be used.
installed package tasty-1.3.1 is broken due to missing package ansi-terminal-0.11-2SXi8ZhU18i2uWLidRUotS, async-2.2.2-K8T9LglWxlG5HgD5vvGjbo, optparse-applicative-0.16.1.0-JDPEASK1GJS1Nsq2qjjZCq
installed package tasty-quickcheck-0.10.1.2 is broken due to missing package QuickCheck-2.14.2-io0WylueSG4seqSTUQCKM, optparse-applicative-0.16
 135 PackagesBug ReportMediumLow namcap fails on libxkbcommon Closed
100%
Task Description
Checking PKGBUILD
Traceback (most recent call last):
  File "/usr/lib/python3.9/runpy.py", line 197, in _run_module_as_main
    return _run_code(code, main_globals, None,
  File "/usr/lib/python3.9/runpy.py", line 87, in _run_code
    exec(code, run_globals)
  File "/usr/lib/python3.9/site-packages/namcap.py", line 247, in <module>
    process_pkgbuild(package, active_modules)
  File "/usr/lib/python3.9/site-packages/namcap.py", line 153, in process_pkgbuild
    name = "PKGBUILD (" + pkginfo["name"] + ")"
  File "/usr/lib/python3.9/site-packages/Namcap/package.py", line 128, in __getitem__
    return self._data[self.canonical_varname(key)]
KeyError: 'name'
==> Running checkpkg
error: no targets specified (use -h for help)
==> WARNING: Skipped checkpkg due to missing repo packages
 133 PackagesBug ReportMediumLow libao and libpulse mixup Closed
100%
Task Description
resolving dependencies...
warning: cannot resolve "libpulse.so=0-32", a dependency of "libao"
warning: cannot resolve "libpulse-simple.so=0-32", a dependency of "libao"
:: The following package cannot be upgraded due to unresolvable dependencies:
      libao

:: Do you want to skip the above package for this upgrade? [y/N] n
error: failed to prepare transaction (could not satisfy dependencies)
:: unable to satisfy dependency 'libpulse.so=0-32' required by libao
:: unable to satisfy dependency 'libpulse-simple.so=0-32' required by libao
132PackagesBug ReportMediumLowOLPC-XO-1 kernel, usb8xx module crashingNew
0%
Task Description
[   21.686772] usb8xxx: Firmware ready event received
[   21.717061] usb8xxx 1-1:1.0 (unnamed net_device) (uninitialized): 00:17:c4:10:e3:67, fw 5.110.22p23, cap 0x000003a3
[   21.897489] usb8xxx 1-1:1.0 wlan0: Marvell WLAN 802.11 adapter
[   22.004871] usb8xxx 1-1:1.0 wlan0: PREP_CMD: command 0x0074 failed: 2
[   22.109002] usb8xxx 1-1:1.0 wlan0: Firmware does not seem to support PS mode
[   22.217405] usb8xxx 1-1:1.0 wlan0: PREP_CMD: command 0x0043 failed: 1
[   22.318862] usb8xxx 1-1:1.0 wlan0: HOST_SLEEP_CFG failed 1
[   23.468484] usb8xxx 1-1:1.0 wlp0s15f5u1: renamed from msh0
[   43.523176] ------------[ cut here ]------------
[   43.556197] WARNING: CPU: 0 PID: 148 at net/wireless/core.c:1346 cfg80211_netdev_notifier_call+0x102/0x31e
[   43.625361] Modules linked in: input_leds led_class usb8xxx libertas serio_raw
[   43.664224] CPU: 0 PID: 148 Comm: wpa_supplicant Not tainted 5.10.5-arch1-1.0-olpc-xo1 #1
[   43.715531] Hardware name: OLPC XO/XO, BIOS OLPC Ver 1.00.01 06/11/2014
[   43.754829] EIP: cfg80211_netdev_notifier_call+0x102/0x31e
[   43.792862] Code: ff 89 f0 e8 4d fc ff ff 8b 46 7c 85 c0 74 2a 39 58 34 75 25 80 78 64 00 75 16 8b 96 80 00 00 00 85 d2 74 06 80 7a 64 00 75 06 <0f> 0b c6 40 62 01 31 d2 89 f0 e8 3d 7a 00 00 8b 86 88 00 00 00 8b
[   43.911511] EAX: c36e1d00 EBX: c2cb8800 ECX: ffffffff EDX: 00000000
[   43.958939] ESI: c341c000 EDI: c1f7d000 EBP: c1eebdd4 ESP: c1eebdbc
[   44.002464] DS: 007b ES: 007b FS: 0000 GS: 00e0 SS: 0068 EFLAGS: 00010246
[   44.045454] CR0: 80050033 CR2: b69e5428 CR3: 01ff0000 CR4: 00000090
[   44.088019] Call Trace:
[   44.126010]  ? fib_disable_ip+0x2a/0x2d
[   44.165297]  ? cfg80211_register_wdev+0x46/0x46
[   44.208941]  notifier_call_chain+0x2a/0x4e
[   44.252482]  raw_notifier_call_chain+0xc/0xe
[   44.296501]  call_netdevice_notifiers_info+0x5d/0x64
[   44.338599]  call_netdevice_notifiers+0x18/0x1a
[   44.379580]  __dev_notify_flags+0x4a/0x7c
[   44.419064]  dev_change_flags+0x3d/0x46
[   44.464304]  devinet_ioctl+0x260/0x4cd
[   44.502437]  inet_ioctl+0x139/0x163
[   44.539766]  ? dev_name_hash+0x20/0x36
[   44.577060]  ? dev_get_by_name_rcu+0x1c/0x2f
[   44.614874]  ? dev_ioctl+0x2e4/0x40e
[   44.651928]  ? inet_recvmsg+0x77/0x77
[   44.692778]  sock_ioctl+0x2ad/0x36f
[   44.730157]  ? preempt_count_add+0x4a/0x4f
[   44.771397]  ? ____sys_recvmsg+0xbc/0xbc
[   44.808485]  vfs_ioctl+0x1a/0x24
[   44.847256]  __ia32_sys_ioctl+0x5aa/0x5c4
[   44.891962]  ? debug_smp_processor_id+0x12/0x14
[   44.930996]  ? fpregs_assert_state_consistent+0x17/0x34
[   44.967562]  ? exit_to_user_mode_prepare+0x84/0x94
[   45.002448]  do_int80_syscall_32+0x2c/0x39
[   45.035656]  entry_INT80_32+0xf3/0xf3
[   45.067762] EIP: 0xb790ffc4
[   45.097915] Code: 83 c4 0c 89 d8 5b 5e 5f 5d c3 66 90 66 90 66 90 66 90 66 90 66 90 53 8b 54 24 10 8b 4c 24 0c 8b 5c 24 08 b8 36 00 00 00 cd 80 <5b> 3d 01 f0 ff ff 0f 83 a0 3f f3 ff c3 66 90 66 90 66 90 66 90 66
[   45.199342] EAX: ffffffda EBX: 00000007 ECX: 00008914 EDX: bffe736c
[   45.233187] ESI: bffe736c EDI: 0076c850 EBP: 00000000 ESP: bffe7348
[   45.266705] DS: 007b ES: 007b FS: 0000 GS: 0033 SS: 007b EFLAGS: 00000296
[   45.300799] ---[ end trace 20811b76aa348f84 ]---
[   64.909322] IPv6: ADDRCONF(NETDEV_CHANGE): wlp0s15f5u1: link becomes ready

Warm reboot a second time seems to help.

 131 PackagesBug ReportMediumLow libseccomp doesn't build in python bindings Closed
100%
Task Description

no task description

 130 PackagesBug ReportMediumLow user-manager and plasma-meta are in conflict Closed
100%
Task Description

:: removing user-manager breaks dependency ‘user-manager’ required by plasma-meta

 129 PackagesBug ReportMediumLow rust 1.47 is outdated Closed
100%
Task Description

either building 1.49 via 1.48, via 1.47 or we have to bootstrap from a binary version again.

 128 PackagesBug ReportMediumLow newsboat needs rebuild against newer libjson-c Closed
100%
Task Description
newsboat: error while loading shared libraries: libjson-c.so.4: cannot open shared object file: No such file or directory
 127 PackagesBug ReportMediumLow iotop doesn't work Closed
100%
Task Description
root@arch32-stable-pentium4 ~]# iotop
No module named 'iotop'
To run an uninstalled copy of iotop,
launch iotop.py in the top directory

iotop is a Python script, presumably some Python modules are missing.

126PackagesBug ReportMediumLowlua hooks break in TeX on i686New
0%
Task Description
PANIC: unprotected error in call to Lua API (CPU with SSE2 required)
PANIC: unprotected error in call to Lua API (CPU with SSE2 required)
fmtutil [ERROR]: running `luajittex -ini   -jobname=luajittex -progname=luajittex luatex.ini </dev/null' return status: 1
fmtutil [ERROR]: cannot copy log luajittex.log to: /var/lib/texmf/web2c/luajittex
fmtutil [ERROR]: returning error due to option --strict
fmtutil [ERROR]: running `luajithbtex -ini   -jobname=luajithbtex -progname=luajithbtex luatex.ini </dev/null' return status: 1
fmtutil [ERROR]: cannot copy log luajithbtex.log to: /var/lib/texmf/web2c/luajithbtex
fmtutil [ERROR]: returning error due to option --strict
error: command failed to execute correctly
 125 PackagesBug ReportMediumLow seamonkey broken on i686 Closed
100%
Task Description

breaks in more SIMD optimizations.

 124 PackagesBug ReportMediumLow mutter and gnome-shell are in confllict Closed
100%
Task Description

:: installing mutter (3.38.1-1.1) breaks dependency ‘libmutter-6.so=0-32’ required by gnome-shell

 123 PackagesBug ReportMediumLow libhandy0, libhandy conflicts Closed
100%
Task Description

libhandy0: /usr/share/vala/vapi/libhandy-0.0.deps exists in filesystem (owned by libhandy)
libhandy0: /usr/share/vala/vapi/libhandy-0.0.vapi exists in filesystem (owned by libhandy)

116PackagesBug ReportMediumLowRace causes iptables not to be ready after startupNew
0%
Task Description

Nov 06 08:04:01 eurohp1 systemd[1]: Starting IPv4 Packet Filtering Framework… Nov 06 08:04:01 eurohp1 iptables-restore[287]: Another app is currently holding the xtables lock. Perhap>
Nov 06 08:04:01 eurohp1 systemd[1]: iptables.service: Main process exited, code=exited, status=4/NOPERMI>
Nov 06 08:04:01 eurohp1 systemd[1]: iptables.service: Failed with result ‘exit-code’.
Nov 06 08:04:01 eurohp1 systemd[1]: Failed to start IPv4 Packet Filtering Framework.

Works when starting iptables later manually.

This is security relevant as not having a firewall after startup puts the system at risk.

 115 PackagesBug ReportMediumLow gnome doesn't start Closed
100%
Task Description

gnome-shell segfaults in libmutter.

                                                               Stack trace of thread 1009:
                                                               #0  0x00000000b64d5436 n/a (libmutter-cogl-6.so.0 + 0xe436)
                                                               #1  0x00000000b64d809c n/a (libmutter-cogl-6.so.0 + 0x1109c)
                                                               #2  0x00000000b653edb9 n/a (libmutter-cogl-6.so.0 + 0x77db9)
                                                               #3  0x00000000b64f8fc5 cogl_flush (libmutter-cogl-6.so.0 + 0x31fc5)
                                                               #4  0x00000000b6549154 cogl_onscreen_swap_buffers_with_damage (libmutter-cogl-6.so.0 + 0x82154)
                                                               #5  0x00000000b6c59f73 n/a (libmutter-clutter-6.so.0 + 0x10ff73)
                                                               #6  0x00000000b6c53cf2 n/a (libmutter-clutter-6.so.0 + 0x109cf2)
                                                               #7  0x00000000b6c54747 n/a (libmutter-clutter-6.so.0 + 0x10a747)
                                                               #8  0x00000000b6bf52ad n/a (libmutter-clutter-6.so.0 + 0xab2ad)
                                                               #9  0x00000000b7703bde g_main_context_dispatch (libglib-2.0.so.0 + 0x4dbde)
                                                               #10 0x00000000b7752962 n/a (libglib-2.0.so.0 + 0x9c962)
                                                               #11 0x00000000b7702299 g_main_loop_run (libglib-2.0.so.0 + 0x4c299)
                                                               #12 0x00000000b697f216 meta_run (libmutter-6.so.0 + 0xb9216)
                                                               #13 0x000000000043144e n/a (gnome-shell + 0x244e)
                                                               #14 0x00000000b7cd900e __libc_start_main (libc.so.6 + 0x1f00e)
                                                               #15 0x0000000000431635 n/a (gnome-shell + 0x2635)
109PackagesBug ReportMediumLowgcc10 -fno-common breaks jdkNew
0%
Task Description

/usr/bin/ld: /build/java-openjdk/src/jdk14u-jdk-14.0.1+7/build/linux-x86-server-release/support/native/java.base/libjava/childproc.o:/build/java-openjdk/src/jdk14u-jdk-14.0.1+7/src/java.base/unix/native/libjava/childproc.h:129: multiple definition of `parentPathv’; /build/java-openjdk/src/jdk14u-jdk-14.0.1+7/build/linux-x86-server-release/support/native/java.base/libjava/ProcessImpl_md.o:/build/java-openjdk/src/jdk14u-jdk-14.0.1+7/src/java.base/unix/native/libjava/childproc.h:129: first defined here

collect2: error: ld returned 1 exit status

This is fixed known and fixed upstream (without just setting
-fcommon again):

https://bugs.openjdk.java.net/browse/JDK-8235903

 105 Packages: StableBug ReportMediumLow chromium crash in blocked syscalls (libseccomp) Closed
100%
Task Description

chromium apparently also has trouble in some seccomp jailing:

 ../../sandbox/linux/seccomp-bpf-helpers/sigsys_handlers.cc:**CRASHING**:seccomp-bpf failure in syscall 0403
../../sandbox/linux/seccomp-bpf-helpers/sigsys_handlers.cc:**CRASHING**:seccomp-bpf failure in syscall 0403
../../sandbox/linux/seccomp-bpf-helpers/sigsys_handlers.cc:**CRASHING**:seccomp-bpf failure in syscall 0403
../../sandbox/linux/seccomp-bpf-helpers/sigsys_handlers.cc:**CRASHING**:seccomp-bpf failure in syscall 0403
../../sandbox/linux/seccomp-bpf-helpers/sigsys_handlers.cc:**CRASHING**:seccomp-bpf failure in syscall 0403
../../sandbox/linux/seccomp-bpf-helpers/sigsys_handlers.cc:**CRASHING**:seccomp-bpf failure in syscall 0403
../../sandbox/linux/seccomp-bpf-helpers/sigsys_handlers.cc:**CRASHING**:seccomp-bpf failure in syscall 0403
../../sandbox/linux/seccomp-bpf-helpers/sigsys_handlers.cc:**CRASHING**:seccomp-bpf failure in syscall 0403
../../sandbox/linux/seccomp-bpf-helpers/sigsys_handlers.cc:**CRASHING**:seccomp-bpf failure in syscall 0403
[1201:1210:0227/131355.020958:FATAL:gpu_data_manager_impl_private.cc(990)] The display compositor is frequently crashing. Goodbye.

[1]+  Trace/breakpoint trap   (core dumped) chromium
103Packages: StableBug ReportMediumLowyarn segfaultsNew
0%
Task Description

experienced when building buildbot-www

/bin/sh: line 1: 4744 Segmentation fault (core dumped) yarn install –pure-lockfile

102Packages: StableBug ReportMediumLowfirefox-i18-n gets pushed to stable though firefox is n...New
0%
Task Description

warning: cannot resolve “firefox>=71.0”, a dependency of “firefox-i18n-de”

Showing tasks 1 - 50 of 53 Page 1 of 21 - 2 -

Available keyboard shortcuts

Tasklist

Task Details

Task Editing