• Status New
  • Percent Complete
  • Task Type Bug Report
  • Category Packages
  • Assigned To No-one
  • Operating System pentium4
  • Severity Low
  • Priority Medium
  • Reported Version
  • Due in Version Undecided
  • Due Date Undecided
  • Votes
  • Private
Attached to Project: Arch Linux 32
Opened by Andreas Baumann - 13.01.2022
Last edited by Andreas Baumann - 13.01.2022

FS#228 - [icu69] not updated packages

starting to collect them here packages which require icu69 (and have thus not been rebuilt
for icu 70 yet):

- abiword: libical (rescheduled build)

Andreas Baumann commented on 15.01.2022 10:14

Explains why libical got stuck:

The following tests FAILED:
         43 - libical-glib-array (Failed)
         44 - libical-glib-attach (Failed)
         45 - libical-glib-component (Failed)
         46 - libical-glib-comprehensive (Failed)
         47 - libical-glib-duration (Failed)
         48 - libical-glib-error (Failed)
         49 - libical-glib-misc (Failed)
         50 - libical-glib-parameter (Failed)
         51 - libical-glib-period (Failed)
         52 - libical-glib-property (Failed)
         53 - libical-glib-recurrence (Failed)
         54 - libical-glib-timezone (Failed)
         55 - libical-glib-value (Failed)

Traceback (most recent call last):
  File "/build/libical/src/libical-3.0.12/src/test/libical-glib/error.py", line 21, in <module>
    import gi
ModuleNotFoundError: No module named 'gi'

kjw commented on 18.01.2022 10:51

The calibre package also needs a rebuild:

[ ~]$ calibre
Traceback (most recent call last):
  File "/usr/bin/calibre", line 20, in <module>
    from calibre.gui_launch import calibre
  File "/usr/lib/calibre/calibre/__init__.py", line 22, in <module>
  File "/usr/lib/calibre/calibre/startup.py", line 124, in initialize_calibre
    from calibre.utils.icu import title_case, lower as icu_lower, upper as icu_upper
  File "/usr/lib/calibre/calibre/utils/icu.py", line 13, in <module>
    from calibre_extensions import icu as _icu
ImportError: libicui18n.so.69: cannot open shared object file: No such file or directory
Andreas Baumann commented on 18.01.2022 11:51

Thanks for reporting, can confirm on pentium4/stable.

pentium4: calibre 5.30.0-1.0
i686: calibre 5.33.0-1.0

strange pentium4 got stuck.

5.34.0 resists rebuilding:
https://bugs.archlinux.org/task/73405 and some PGP key issues.

-c: Unable to import 'pyqtbuild': No module named 'pyqtbuild'


Andreas Baumann commented on 18.01.2022 12:05

-c: Unable to find file "QtWidgets/QtWidgetsmod.sip"


Andreas Baumann commented on 18.01.2022 12:13

python-pyqt5-sip, well yea, python 3.10 is sort of half-way done, half-working, half-
broken. :-)

Andreas Baumann commented on 18.01.2022 13:04

sip sip4 pyqt5

the sip-tools have lost entry-points for /usr/bin, hence builds are failing.

Andreas Baumann commented on 18.01.2022 15:13

ImportError: cannot import name 'QWebEngineUrlRequestInfo' from 'qt.webengine' (/build/calibre/src/calibre-5.34.0/src/qt/webengine.py)

now rebuilding is on hold, as qt5-webengine will take a while to fix..

Andreas Baumann commented on 22.01.2022 09:13

Now calibre is ok, but it is linked against python 3.10. I don't dare yet to push python 3.10 to stable as
too many things are still broken..
The fact that python 3.10 is still in staging and not yet in testing is not a good sign: there are circular
dependencies keeping it in staging..

kjw commented on 08.02.2022 10:28

In testing, calibre 5.36.0-1.0 appears to be working ok now with python 3.10.2-1.1

Thank you

kjw commented on 08.02.2022 10:47

The libreoffice-fresh and probably the libreoffice-still packages also need a rebuild.

[~]$ libreoffice 
javaldx: Could not find a Java Runtime Environment!
Warning: failed to read path from javaldx
/usr/lib/libreoffice/program/soffice.bin: error while loading shared libraries: libicuuc.so.69: cannot open shared object file: No such file or directory
kjw commented on 13.02.2022 11:20

In testing, libreoffice-fresh now appears to be working OK.

Thank you.

Seamonkey Bug commented on 30.04.2022 19:06

Seamonkey affected as well.


Available keyboard shortcuts


Task Details

Task Editing