• Status Closed
  • Percent Complete
  • Task Type Bug Report
  • Category Packages
  • Assigned To No-one
  • Operating System pentium4
  • Severity Low
  • Priority Very Low
  • Reported Version
  • Due in Version Undecided
  • Due Date Undecided
  • Votes
  • Private
Attached to Project: Arch Linux 32
Opened by persson - 03.04.2020
Last edited by Andreas Baumann - 19.04.2020

FS#107 - wireguard-dkms-0.0.20200318-1.0 does not build with 5.5.8-arch1-1.0

Installing wireguard-dkms fails with:

(2/2) Install DKMS modules
==> dkms install wireguard/0.0.20200318 -k 5.5.8-arch1-1.0
Error! Bad return status for module build on kernel: 5.5.8-arch1-1.0 (i686)
Consult /var/lib/dkms/wireguard/0.0.20200318/build/make.log for more information.

The file /var/lib/dkms/wireguard/0.0.20200318/build/make.log contains the following messages:

DKMS make.log for wireguard-0.0.20200318 for kernel 5.5.8-arch1-1.0 (i686)
Fri 03 Apr 2020 10:11:21 PM CEST
make: Entering directory '/usr/lib/modules/5.5.8-arch1-1.0/build'
  AR      /var/lib/dkms/wireguard/0.0.20200318/build/built-in.a
  CC [M]  /var/lib/dkms/wireguard/0.0.20200318/build/main.o
cc1: error: incompatible gcc/plugin versions
cc1: error: fail to initialize plugin ./scripts/gcc-plugins/structleak_plugin.so
make[1]: *** [scripts/Makefile.build:266: /var/lib/dkms/wireguard/0.0.20200318/build/main.o] Error 1
make: *** [Makefile:1693: /var/lib/dkms/wireguard/0.0.20200318/build] Error 2
make: Leaving directory '/usr/lib/modules/5.5.8-arch1-1.0/build'
Closed by  Andreas Baumann
19.04.2020 05:34
Reason for closing:  Works for me
Additional comments about closing:  

Builds fine for me on current stable, pentium4 with kernel 5.6.4.
Please try again and reopen the bug, if it still doesn't work for you.


Available keyboard shortcuts


Task Details

Task Editing