Flyspray:: Tue, 20 Aug 2019 16:15:35 +0000 Flyspray::Archlinux32: Recently opened tasks https://bugs.archlinux32.org/ FS#84: openjdk 7 doesn't build Andreas Baumann Tue, 20 Aug 2019 16:14:40 +0000 . /etc/profile.d/apache-ant.sh

is not there anymore.

Required version of freetype: 2.2.1
Detected freetype headers: 2.10.1
Failed: headers are too old.
Detected freetype library: 2.10.1
Failed: too old library.

this one is really funny, some wrong version calculation probabily.

diff -rauN icedtea-2.6.13/configure icedtea-2.6.13-xattr-patch/configure
--- icedtea-2.6.13/configure    2018-02-28 06:32:29.578579918 +0100
+++ icedtea-2.6.13-xattr-patch/configure        2019-08-16 13:33:32.078598083 +0200
@@ -15851,7 +15851,7 @@
 fi
 done
 
-    for ac_header in sys/epoll.h attr/xattr.h
+    for ac_header in sys/epoll.h sys/xattr.h
 do :
   as_ac_Header=`$as_echo "ac_cv_header_$ac_header" | $as_tr_sh`
 ac_fn_c_check_header_mongrel "$LINENO" "$ac_header" "$as_ac_Header" "$ac_includes_default"

xattr.h header file is in sys and now longer in attr. probing fails.

more to come.. :-)

]]>
https://bugs.archlinux32.org/index.php?do=details&task_id=84 https://bugs.archlinux32.org/index.php?do=details&task_id=84
FS#83: kdeinit5 is filling the systemd journal with nonsensical messages Andreas Baumann Sat, 13 Jul 2019 18:14:29 +0000 Jul 13 20:12:45 arch32-stable-pentium4 kdeinit5[1037]: (QUrl("tags:/")) Jul 13 20:12:45 arch32-stable-pentium4 kdeinit5[1037]: () Jul 13 20:12:45 arch32-stable-pentium4 kdeinit5[1037]: (QUrl("tags:/")) Jul 13 20:12:45 arch32-stable-pentium4 kdeinit5[1037]: (QUrl("tags:/")) Jul 13 20:12:45 arch32-stable-pentium4 kdeinit5[1037]: () Jul 13 20:12:45 arch32-stable-pentium4 kdeinit5[1037]: (QUrl("tags:/")) Jul 13 20:12:45 arch32-stable-pentium4 kdeinit5[1037]: (QUrl("tags:/")) Jul 13 20:12:45 arch32-stable-pentium4 kdeinit5[1037]: () Jul 13 20:12:45 arch32-stable-pentium4 kdeinit5[1037]: (QUrl("tags:/")) Jul 13 20:12:45 arch32-stable-pentium4 kdeinit5[1037]: (QUrl("tags:/")) Jul 13 20:12:45 arch32-stable-pentium4 kdeinit5[1037]: () Jul 13 20:12:45 arch32-stable-pentium4 kdeinit5[1037]: (QUrl("tags:/")) Jul 13 20:12:45 arch32-stable-pentium4 kdeinit5[1037]: (QUrl("tags:/")) Jul 13 20:12:45 arch32-stable-pentium4 kdeinit5[1037]: ()
  225 root      20   0  359832 225172 224128 S  24.5  29.5   0:45.52 systemd-journal 

Upstream too? Or is it fast enough if one core is dedicated to output
nonsensical output.. :->

]]>
https://bugs.archlinux32.org/index.php?do=details&task_id=83 https://bugs.archlinux32.org/index.php?do=details&task_id=83
FS#82: [glibc] ld warning: /usr/lib32/ld-linux.so.2: corrupt GNU_PROPERTY_TYPE (5) size: 0 Jeff Hodd Thu, 11 Jul 2019 14:37:18 +0000 All software builds are producing this warning. Some builds are failing because of the error return on linking. I’m also seeing failures on LD_PRELOADs.

/bin/ld: warning: /usr/lib/ld-linux.so.2: corrupt GNU_PROPERTY_TYPE (5) size: 0

Easy to reproduce. Just build this program:

# test.c
# Compiled with 'gcc test.c'
int main() {
    return 0;
}

This was reported at bugs.archlinux.org (reference https://bugs.archlinux.org/task/63015) where it was closed and considered fixed if built using the –enable-cet flag. I built glibc with the –enable-cet flag, but am still seeing the failures, so not fixed.

]]>
https://bugs.archlinux32.org/index.php?do=details&task_id=82 https://bugs.archlinux32.org/index.php?do=details&task_id=82
FS#81: KDE/Plasma crashes on startup (i686) Andreas Baumann Sun, 07 Jul 2019 08:40:19 +0000 Application: ksplashqml (ksplashqml), signal: Aborted Using host libthread_db library "/usr/lib/libthread_db.so.1". [Current thread is 1 (Thread 0xb21d5900 (LWP 427))] Thread 3 (Thread 0xaa75cb40 (LWP 429)): #0 0xb4b95418 in g_main_context_prepare () from /usr/lib/libglib-2.0.so.0 #1 0xb4b959f7 in ?? () from /usr/lib/libglib-2.0.so.0 #2 0xb4b95be6 in g_main_context_iteration () from /usr/lib/libglib-2.0.so.0 #3 0xb6e75ce5 in QEventDispatcherGlib::processEvents(QFlags) () from /usr/lib/libQt5Core.so.5 #4 0xb6e18ef5 in QEventLoop::exec(QFlags) () from /usr/lib/libQt5Core.so.5 #5 0xb6c5fe1a in QThread::exec() () from /usr/lib/libQt5Core.so.5 #6 0xb66317c3 in ?? () from /usr/lib/libQt5Qml.so.5 #7 0xb6c611cc in ?? () from /usr/lib/libQt5Core.so.5 #8 0xb5e34018 in start_thread () from /usr/lib/libpthread.so.0 #9 0xb697c25a in clone () from /usr/lib/libc.so.6 Thread 2 (Thread 0xb1a18b40 (LWP 428)): #0 0xb7f6a82d in __kernel_vsyscall () #1 0xb6972873 in poll () from /usr/lib/libc.so.6 #2 0xb550c6ce in ?? () from /usr/lib/libxcb.so.1 #3 0xb550e864 in xcb_wait_for_event () from /usr/lib/libxcb.so.1 #4 0xb1bad3da in ?? () from /usr/lib/libQt5XcbQpa.so.5 #5 0xb6c611cc in ?? () from /usr/lib/libQt5Core.so.5 #6 0xb5e34018 in start_thread () from /usr/lib/libpthread.so.0 #7 0xb697c25a in clone () from /usr/lib/libc.so.6 Thread 1 (Thread 0xb21d5900 (LWP 427)): [KCrash Handler] #6 0xb7f6a82d in __kernel_vsyscall () #7 0xb68c4376 in raise () from /usr/lib/libc.so.6 #8 0xb68ae299 in abort () from /usr/lib/libc.so.6 #9 0xb6c1f873 in QMessageLogger::fatal(char const*, ...) const () from /usr/lib/libQt5Core.so.5 #10 0xb6387c44 in QV4::Compiler::Codegen::visit(QQmlJS::AST::UiProgram*) () from /usr/lib/libQt5Qml.so.5 #11 0xb64298d6 in QJSEngine::QJSEngine(QJSEnginePrivate&, QObject*) () from /usr/lib/libQt5Qml.so.5 #12 0xb6575fcd in QQmlEngine::QQmlEngine(QObject*) () from /usr/lib/libQt5Qml.so.5 #13 0xb6888bc4 in KDeclarative::QmlObjectSharedEngine::QmlObjectSharedEngine(QObject*) () from /usr/lib/libKF5Declarative.so.5 #14 0xb7f0fb00 in KQuickAddons::QuickViewSharedEngine::QuickViewSharedEngine(QWindow*) () from /usr/lib/libKF5QuickAddons.so.5 #15 0x0040a29b in ?? () #16 0x00408e7a in ?? () #17 0x004095a2 in ?? () #18 0x004081de in ?? () #19 0xb68af7b9 in __libc_start_main () from /usr/lib/libc.so.6 #20 0x004082e5 in _start () [Inferior 1 (process 427) detached] ]]> https://bugs.archlinux32.org/index.php?do=details&task_id=81 https://bugs.archlinux32.org/index.php?do=details&task_id=81 FS#80: kate refuses to build due to some broken shared library dependencies Andreas Baumann Sun, 07 Jul 2019 08:20:31 +0000 /usr/bin/ld: warning: libgit2.so.27, needed by /usr/lib/libKF5TextEditor.so.5.59.0, not found (try using -rpath or -rpath-link) /usr/bin/ld: /usr/lib/libKF5TextEditor.so.5.59.0: undefined reference to `git_blob_lookup' /usr/bin/ld: /usr/lib/libKF5TextEditor.so.5.59.0: undefined reference to `git_repository_open_ext' /usr/bin/ld: /usr/lib/libKF5TextEditor.so.5.59.0: undefined reference to `git_oid_fromstr' /usr/bin/ld: /usr/lib/libKF5TextEditor.so.5.59.0: undefined reference to `git_blob_free' /usr/bin/ld: /usr/lib/libKF5TextEditor.so.5.59.0: undefined reference to `git_libgit2_shutdown' /usr/bin/ld: /usr/lib/libKF5TextEditor.so.5.59.0: undefined reference to `git_repository_free' /usr/bin/ld: /usr/lib/libKF5TextEditor.so.5.59.0: undefined reference to `git_libgit2_init' collect2: error: ld returned 1 exit status ]]> https://bugs.archlinux32.org/index.php?do=details&task_id=80 https://bugs.archlinux32.org/index.php?do=details&task_id=80 FS#79: trojita libstdc++ ABI mismatch Andreas Baumann Sat, 06 Jul 2019 09:16:59 +0000 trojita
trojita: /usr/lib/libstdc++.so.6: version `GLIBCXX_3.4.26’ not found (required by /usr/lib/libQt5WebKit.so.5)

]]>
https://bugs.archlinux32.org/index.php?do=details&task_id=79 https://bugs.archlinux32.org/index.php?do=details&task_id=79
FS#78: The qt5 group contains packages of different versions. Erling Hellenäs Fri, 05 Jul 2019 19:34:31 +0000 The qt5 group contains a qt5-base which is of a later revision, 5.12.4 instead of 5.12.3. pyside2 is also of a this later revision, but I don’t use it. I guess the group should be fixed.

Workaround: I downgraded qt5-base and it is working again.

I get this error: sddm-greeter[441]: Cannot mix incompatible Qt library (version 0x50c03) with this library (version 0x50c04)
Then systemd dumps core.

Excerpt from my journal: External Link

The group definition as seen when installing the group with pacman: External Link

My architecture is i686.

I consider it critical since QT is not working.

]]>
https://bugs.archlinux32.org/index.php?do=details&task_id=78 https://bugs.archlinux32.org/index.php?do=details&task_id=78
FS#77: librsvg doesn't rebuild Andreas Baumann Thu, 30 May 2019 07:31:27 +0000 --> /build/librsvg/src/librsvg/target/release/build/typenum-ff577e94a786118f/out/consts.rs:2113:5 | 2111 | pub type P1024 = PInt; pub type N1024 = NInt; | ----------------------------- previous definition of the type `P1024` here 2112 | pub type U1024 = UInt, B0>, B0>, B0>, B0>, B0>, B0>, B0>, B0>, B0>, B0>; 2113 | pub type P1024 = PInt; pub type N1024 = NInt; | ^^^^^^^^^^^^^^^^^^^^^^^^^^^^^ `P1024` redefined here | = note: `P1024` must be defined only once in the type namespace of this module error[E0428]: the name `N1024` is defined multiple times --> /build/librsvg/src/librsvg/target/release/build/typenum-ff577e94a786118f/out/consts.rs:2113:35 | 2111 | pub type P1024 = PInt; pub type N1024 = NInt; | ----------------------------- previous definition of the type `N1024` here 2112 | pub type U1024 = UInt, B0>, B0>, B0>, B0>, B0>, B0>, B0>, B0>, B0>, B0>; 2113 | pub type P1024 = PInt; pub type N1024 = NInt; | ^^^^^^^^^^^^^^^^^^^^^^^^^^^^^ `N1024` redefined here | = note: `N1024` must be defined only once in the type namespace of this module error: aborting due to 3 previous errors For more information about this error, try `rustc --explain E0428`. error: Could not compile `typenum`. Caused by: process didn't exit successfully: `rustc --crate-name typenum /build/.cargo/registry/src/github.com-1ecc6299db9ec823/typenum-1.10.0/src/lib.rs --color never --crate-type lib --emit=dep-info,link -C opt-level=3 -C debuginfo=2 -C metadata=045a2ce7f5cfaab5 -C extra-filename=-045a2ce7f5cfaab5 --out-dir /build/librsvg/src/librsvg/target/release/deps -L dependency=/build/librsvg/src/librsvg/target/release/deps --cap-lints allow -C target-cpu=pentium3 -C target-feature=-sse2` (exit code: 1) warning: build failed, waiting for other jobs to finish... error: build failed make[2]: *** [Makefile:1934: /build/librsvg/src/librsvg/target/release/librsvg_internals.a] Error 101 make[2]: Leaving directory '/build/librsvg/src/librsvg' make[1]: *** [Makefile:1438: all-recursive] Error 1 make[1]: Leaving directory '/build/librsvg/src/librsvg' make: *** [Makefile:931: all] Error 2

The same error with typenum as when bootstrapping rust in stage 2.

librsvg is very important as it blocks tons of other stuff (so why
again was it written in Rust?!)

I might have seen a Debian patch for it, but Debian goes a “complete
Rust micro-packaging” way, not sure whether we can apply it here?

]]>
https://bugs.archlinux32.org/index.php?do=details&task_id=77 https://bugs.archlinux32.org/index.php?do=details&task_id=77
FS#76: libreoffice-fresh needs to be rebuild against icu Raphael Scholer Sat, 25 May 2019 17:31:15 +0000 https://bugs.archlinux32.org/index.php?do=details&task_id=76 https://bugs.archlinux32.org/index.php?do=details&task_id=76 FS#75: openjdk8/10/11/12 break with march=pentium4 optimization Andreas Baumann Sat, 18 May 2019 18:08:43 +0000 This blocks ant, needed for building libreoffice.

]]>
https://bugs.archlinux32.org/index.php?do=details&task_id=75 https://bugs.archlinux32.org/index.php?do=details&task_id=75